{"text_format":"1","workbook":"xlsx","n_sheets":5,"sheets":["Pasture Maintenance","Chemicals","Machinery","Seed","Rates"],"not_rendered":{"charts":0,"images":1,"macros":1,"external_links":1,"defined_names":9,"comments":4,"pivot_tables":0},"unopened":[],"bounds":{"document_bytes":16777216,"sheet_cells":100000,"rows_first":2000,"rows_last":500,"rows_between":2000,"halvings":0,"cell_chars":16384,"cell_head_chars":4096},"cells_cut":0,"cells_raw":0,"read":"whole","date_system":"1900"}

{"sheet":"Pasture Maintenance","index":0,"n_rows":159,"n_cols":24,"rows_kept":159,"cut":false,"hidden":false,"merged":[[82,10,82,12],[48,4,48,5],[107,0,107,7],[108,0,108,7]]}
[]
[2024,null,null,null,null,null,null,"PUBLICATION 446-047 ",null,null,null,null,null,null,null,null,null,null,""]
[null,null,null,"Pasture Maintenance"]
[null,1,"Year Average Cost per Acre",null,null,null,null,"Acres",null,null,"",null,null,null,null,null,null,null,""]
[null,null,null,null,null,null,null,1]
[null,null,null,null,"QUANTITY"," PRICE OR",null,"YOUR"]
["",null,null,"UNIT","PER ACRE","COST/UNIT","TOTAL","FARM",null,"","",null,null,null,null,null,null,null,""]
[]
["1. GROSS RECEIPTS"]
[null,"IMPROVED PASTURE",300,"Grazing Days",{"$f":"B4*C10","v":300},0.5,{"$f":"ROUND((E10*F10),2)","v":150},{"$f":"IF($H$5=1,\" \",IF(E10=0,\" \",$H$5*G10))","v":" "},null,null,"",null,null,null,null,null,null,null,""]
[null,null,null,"","","",null,null,null,null,null,"",null,null,null,null,null,null,"",null,null,null,null,""]
[null,"TOTAL RECEIPTS:",null,null,null,null,{"$f":"SUM(G10:G11)","v":150},{"$f":"IF(G12=0,\" \",IF($H$5=1,\" \",$H$5*G12))","v":" "},null,null,"","",null,null,null,null,null,null,"",null,null,null,null,""]
[null,null,null,"","","","",null,null,null,"","",null,null,null,null,null,null,"",null,null,null,null,""]
["2. PRE-HARVEST VARIABLE COSTS",null,null,"","","","",null,null,"Codes",null,null,null,null,null,null,null,null,"",null,null,null,null,""]
[null,"  Prorated Establishment Cost",50,"YRS -ACRE",{"$f":"IF($E$53=1,1,1)","v":1},400,{"$f":"(F15/C15)^(1+F35)","v":8.693878900208464},{"$f":"IF($H$5=1,\" \",IF(E15=0,\" \",$H$5*G15))","v":" "},null,null,null,null,null,null,null,null,null,null,""]
[null,{"$f":"IF($J16=0,\" \",VLOOKUP($J16,Seeds,2))","v":"  SEED: CLOVER - Ladino"},null,{"$f":"IF($J16=0,\" \",VLOOKUP($J16,Seeds,4))","v":"LBS"},4,{"$f":"IF(J16=0,\" \",VLOOKUP(J16,Seeds,8))","v":3.85},{"$f":"IF(J16=0,\" \",ROUND((E16*F16),2))","v":15.4},{"$f":"IF($H$5=1,\" \",IF(E16=0,\" \",$H$5*G16))","v":" "},null,114]
[null,"  FERTILIZER* ","Soil Test Recommendation",null,"",{"$f":"IF(J17=0,\" \",VLOOKUP(J17,Seeds,8))","v":" "},"","Fertilizer&Seed:",null,null,null,null,null,null,null,null,null,null,""]
[null,"    NITROGEN ",null,"LBS",0,0.52,{"$f":"IF(C18=0,ROUND((E18*F18),2),ROUND((C18*F18),2))","v":0},{"$f":"SUM(G15:G22)","v":55.423878900208464},null,504,"",null,null,null,null,null,null,null,""]
[null,"    PHOSPHATE",0,"LBS",20,0.62,{"$f":"IF(C19=0,ROUND((E19*F19),2),ROUND((C19*F19),2))","v":12.4},{"$f":"IF($H$5=1,\" \",IF(E19=0,\" \",$H$5*G19))","v":" "},null,514,"",null,null,null,null,null,null,null,"",null,null,null,null,""]
[null,"    POTASH",null,"LBS",15,0.42,{"$f":"IF(C20=0,ROUND((E20*F20),2),ROUND((C20*F20),2))","v":6.3}," ",null,512,"","",null,null,null,null,null,null,"",null,null,null,null,""]
[null,{"$f":"IF($J21=0,\" \",VLOOKUP($J21,Seeds,2))","v":" Poultry Litter"},null,"TON",0,35,{"$f":"IF(J21=0,\" \",ROUND((E21*F21),2))","v":0}," ",null,755]
[null,"  LIME (PRORATED)",null,{"$f":"VLOOKUP(J22,Seeds,4)","v":"TON"},0.25,50.5,{"$f":"IF(J22=0,\" \",ROUND((E22*F22),2))","v":12.63},"Herbicides:",null,518,"","",null,null,null,null,null,null,""]
[null,"  HERBICIDES",null,"ACRE",{"$f":"IF($E$53=1,1,1)","v":1},{"$f":"L106","v":5.84},{"$f":"ROUND((E23*F23),2)","v":5.84},{"$f":"G23","v":5.84},null,null,"","",null,null,null,null,null,null,""]
[null,"  INSECTICIDES",null,"ACRE",{"$f":"IF($E$53=1,1,1)","v":1},{"$f":"M106","v":0},{"$f":"ROUND((E24*F24),2)","v":0}," "]
[null,"  FUNGICIDES",null,"ACRE",{"$f":"IF($E$53=1,1,1)","v":1},{"$f":"N106","v":0},{"$f":"ROUND((E25*F25),2)","v":0}," "]
[null,"  CHEMICAL APPLICATION",null,"ACRE",0,{"$f":"IF(J26=0,\" \",VLOOKUP(J26,Chem_P,8))","v":0},{"$f":"ROUND((E26*F26),2)","v":0},"Mowing & Spraying Fixed&Variable Costs, not labor:",null,999]
[null,"  FUEL,OIL, LUBE",null,"Eq Gallons",{"$f":"F83/F$90","v":4.55},{"$f":"F$90","v":2.4},{"$f":"ROUND((E27*F27),2)","v":10.92},{"$f":"G27+G28+G59","v":26.41}]
[null,"  REPAIRS",null,"ACRE",{"$f":"IF($E$53=1,1,1)","v":1},{"$f":"G83","v":6.1},{"$f":"ROUND((E28*F28),2)","v":6.1},"Labor"]
[null,"  PRE-HARVEST LABOR",null,"HRS",{"$f":"D83","v":1.29},0,0,{"$f":"G29","v":0}]
[null,"  CASH RENT OR LAND CHARGE",null,"ACRE",{"$f":"IF($E$53=1,1,1)","v":1},0,0]
[null,"  CROP INSURANCE",null,"ACRE",{"$f":"IF($E$53=1,1,1)","v":1},{"$f":"Rates!G37","v":6.41},6.41]
[null,"Fence Maintenance",null,"ACRE",{"$f":"IF($E$53=1,1,1)","v":1},0,0]
[null,"  OTHER COSTS",null,"ACRE",{"$f":"IF($E$53=1,1,1)","v":1},0,0," "]
[null,null,null,null,null,null,null," "]
[null,"  Production Interest",6,"MONTHS",{"$f":"ROUND(SUM(G15:G34)*$C$35/12,2)","v":42.35},0.04,{"$f":"ROUND((E35*F35),2)","v":1.69}," "]
[]
[null,"TOTAL PRE-HARVEST COSTS",null,null,{"$f":"G37/E10","v":0.28794626300069487},"PER DAY",{"$f":"SUM(G14:G35)","v":86.383878900208458},{"$f":"IF(G37=0,\" \",IF($H$5=1,\" \",$H$5*G37))","v":" "},null,null,"",null,null,null,null,null,null,null,"",null,null,null,null,""]
[null,null,null,null,{"$f":"G37/B4","v":86.383878900208458},"PER YEAR"]
[null,null,null,null,null,null,null,null,null,null,"",null,null,null,null,null,null,null,""]
["3. HARVEST VARIABLE COSTS"]
[null,"  FUEL,OIL, LUBE",null,"Eq Gallons",{"$f":"F88/F$90","v":0},{"$f":"F$90","v":2.4},{"$f":"ROUND((E41*F41),2)","v":0},{"$f":"IF($H$5=1,\" \",IF(E41=0,\" \",$H$5*G41))","v":" "}]
[null,"  REPAIRS",null,"ACRE",{"$f":"IF($E$53=1,1,1)","v":1},{"$f":"G88","v":0},0," "]
[null,"  HARVEST LABOR",null,"HRS",{"$f":"D88","v":0},{"$f":"Rates!$E$11","v":16},0," ",null,null,"",null,null,null,null,null,null,null,""]
[null,"  HAULING",null,"Grazing Days",{"$f":"E10","v":300},null,0," ",null,null,"",null,null,null,null,null,null,null,""]
[null,"  STORAGE",null,"Grazing Days",{"$f":"E10","v":300},null,0," ",null,null,"",null,null,null,null,null,null,null,""]
[null,"  DRYING",null,"Grazing Days",{"$f":"E10","v":300},null,0," ",null,null,"",null,null,null,null,null,null,null,""]
[null,null,null,null,null,null,null,null,null,null,"",null,null,null,null,null,null,null,"",null,null,null,null,""]
[null,"TOTAL HARVEST COSTS:",null,null,null,null,{"$f":"SUM(G40:G47)","v":0},{"$f":"IF(G48=0,\" \",IF($H$5=1,\" \",$H$5*G48))","v":" "},null,null,"",null,null,null,null,null,null,null,"",null,null,null,null,""]
[null,null,"Breakeven Yield",null,"Breakeven Price"]
["4. TOTAL VARIABLE COSTS",null,{"$f":"IF(F10<=0,\" \",G50/$F$10)","v":172.76775780041692},"Days",{"$f":"G50/$E$10","v":0.28794626300069487},"Per Day",{"$f":"G37+G48","v":86.383878900208458},{"$f":"IF(G50=0,\" \",IF($H$5=1,\" \",$H$5*G50))","v":" "}]
[null,null,null,null,{"$f":"G50/B4","v":86.383878900208458},"Per Year"]
["5. RETURN OVER TOTAL VARIABLE COSTS",null,null,null,null,null,{"$f":"G12-G50","v":63.616121099791542},{"$f":"IF(G52=0,\" \",IF($H$5=1,\" \",$H$5*G52))","v":" "}]
[]
["6. MACHINERY FIXED COSTS (BASED ON NEW EQUIPMENT COST)",null,null,null,null,null,"",null,null,null,null,null,null,null,null,null,null,null,"",null,null,null,null,""]
[null," TRACTOR & MACHINERY",null,"ACRE",1,{"$f":"H83+H88","v":9.39},{"$f":"ROUND((E55*F55),2)","v":9.39},{"$f":"IF($H$5=1,\" \",IF(E55=0,\" \",$H$5*G55))","v":" "}]
["7. OTHER FIXED COSTS",null,null,null,null,null,null,null,null,null,null,null,null,null,null,null,null,null,""]
[null,"GENERAL OVERHEAD",null,"DOL.",{"$f":"(G50)","v":86.383878900208458},0,{"$f":"ROUND((E57*F57),2)","v":0},{"$f":"IF($H$5=1,\" \",IF(E57=0,\" \",$H$5*G57))","v":" "},null,null,null,null,null,null,null,null,null,null,"",null,null,null,null,""]
[null,null,null,"","",null,null,null,null,null,null,null,null,null,null,null,null,null,""]
["8. TOTAL FIXED COSTS:",null,null,null,null,null,{"$f":"SUM(G55:G57)","v":9.39},{"$f":"IF(G59=0,\" \",IF($H$5=1,\" \",$H$5*G59))","v":" "},null,null,null,null,null,null,null,null,null,null,""]
[null,null,null,null,null,null,null,null,null,null,null,null,null,null,null,null,null,null,"",null,null,null,null,""]
["9. TOTAL VARIABLE & FIXED COSTS",null,null,null,{"$f":"G61/$E$10","v":0.31924626300069486},"Per Day",{"$f":"G50+G59","v":95.773878900208459},{"$f":"IF(G61=0,\" \",IF($H$5=1,\" \",$H$5*G61))","v":" "},null,null,null,null,null,null,null,null,null,null,"",null,null,null,null,""]
[null,null,null,null,{"$f":"G61/B4","v":95.773878900208459},"Per Year"]
[null,null,null,null,null,null,null,null,null,null,null,null,null,null,null,null,null,null,""]
["10. PROJECTED NET RETURNS TO LAND, RISK AND MANAGEMENT:",null,null,null,null,null,{"$f":"G12-G61","v":54.226121099791541},{"$f":"IF(G64=0,\" \",IF($H$5=1,\" \",$H$5*G64))","v":" "},null,null,"",null,null,null,null,null,null,null,"",null,null,null,null,""]
["* PLEASE NOTE: THIS BUDGET IS FOR PLANNING PURPOSES ONLY. ",null,null,null,null,null,null,null,null,null,"","",null,null,null,null,null,null,"",null,null,null,null,""]
["* Fertilizer requirements will vary with application method, and/or residual nutrient levels in the plant & soil."]
[]
[]
[]
[]
[]
[null,null,null,null,null,null,null,null,null,null,"","",null,null,null,null,null,null,"",null,null,null,null,""]
[{"$f":"D3","v":"Pasture Maintenance"},null,null,null,null,null,null,null,null,null,"",null,null,null,null,null,null,null,"",null,null,null,null,""]
[null,"PER ACRE MACHINERY AND LABOR REQUIREMENTS",null,null,null,null,null,null,null,null,"",null,null,null,null,null,null,null,"",null,null,null,null,""]
["MONTH","   OPERATION ","Times"," LABOR","MACHINE","FUEL, OIL,","REPAIR","  FIXED",null,null,"",null,null,null,null,null,null,null,"",null,null,null,null,""]
[null,null,"OVER"," HOURS"," HOURS","& LUBE","COSTS","COSTS",null,"EQUIP","",null,null,null,null,null,null,null,"",null,null,null,null,""]
["PRE-HARVEST",null,null,null,null,null,null,null,null,"Codes","",null,null,null,null,null,null,null,""]
[null,{"$f":"IF(J78=0,\" \",VLOOKUP(J78,Mach_Costs,2))","v":"75HP+Rotary Mower-10FT Pulled"},{"$f":"B4","v":1},{"$f":"IF(J78=0,0,ROUND(E78*Rates!$E$15,2))","v":0.23},{"$f":"IF(J78=0,0,IF(J78<30,C78,VLOOKUP(J78,Mach_Costs,9)*C78))","v":0.21},{"$f":"IF(J78=0,0,IF(J78<30,VLOOKUP(J78,Mach_Costs,4)*C78,VLOOKUP(J78,Mach_Costs,13)*C78))*$N$83","v":2.59},{"$f":"IF(J78=0,0,IF(J78<30,VLOOKUP(J78,Mach_Costs,5)*C78,VLOOKUP(J78,Mach_Costs,14)*C78))","v":1.6},{"$f":"IF(J78=0,0,IF(J78<30,VLOOKUP(J78,Mach_Costs,7)*C78,VLOOKUP(J78,Mach_Costs,16)*C78))","v":2.52},null,422,"",null,"",null,null,null,null,null,"",null,null,null,null,""]
[null,{"$f":"IF(J79=0,\" \",VLOOKUP(J79,Mach_Costs,2))","v":"55HP +  Mounted Sprayer"},1,{"$f":"IF(J79=0,0,ROUND(E79*Rates!$E$15,2))","v":0.18},{"$f":"IF(J79=0,0,IF(J79<30,C79,VLOOKUP(J79,Mach_Costs,9)*C79))","v":0.16},{"$f":"IF(J79=0,0,IF(J79<30,VLOOKUP(J79,Mach_Costs,4)*C79,VLOOKUP(J79,Mach_Costs,13)*C79))*$N$83","v":1.43},{"$f":"IF(J79=0,0,IF(J79<30,VLOOKUP(J79,Mach_Costs,5)*C79,VLOOKUP(J79,Mach_Costs,14)*C79))","v":1},{"$f":"IF(J79=0,0,IF(J79<30,VLOOKUP(J79,Mach_Costs,7)*C79,VLOOKUP(J79,Mach_Costs,16)*C79))","v":1.53},null,265,"",null,"",null,null,null,null,null,"",null,null,null,null,""]
[null,{"$f":"IF(J80=0,\" \",VLOOKUP(J80,Mach_Costs,2))","v":"75HP + Granular Applicator"},1,{"$f":"IF(J80=0,0,ROUND(E80*Rates!$E$15,2))","v":0.62},{"$f":"IF(J80=0,0,IF(J80<30,C80,VLOOKUP(J80,Mach_Costs,9)*C80))","v":0.56000000000000005},{"$f":"IF(J80=0,0,IF(J80<30,VLOOKUP(J80,Mach_Costs,4)*C80,VLOOKUP(J80,Mach_Costs,13)*C80))*$N$83","v":6.9},{"$f":"IF(J80=0,0,IF(J80<30,VLOOKUP(J80,Mach_Costs,5)*C80,VLOOKUP(J80,Mach_Costs,14)*C80))","v":3.5},{"$f":"IF(J80=0,0,IF(J80<30,VLOOKUP(J80,Mach_Costs,7)*C80,VLOOKUP(J80,Mach_Costs,16)*C80))","v":5.34},null,259,null,null,null,null,null,null,null,null,null,null,null,null,null,""]
[null,{"$f":"IF(J81=0,\" \",VLOOKUP(J81,Mach_Costs,2))","v":" "},null,{"$f":"IF(J81=0,0,ROUND(E81*Rates!$E$15,2))","v":0},{"$f":"IF(J81=0,0,IF(J81<30,C81,VLOOKUP(J81,Mach_Costs,9)*C81))","v":0},{"$f":"IF(J81=0,0,IF(J81<30,VLOOKUP(J81,Mach_Costs,4)*C81,VLOOKUP(J81,Mach_Costs,13)*C81))*$N$83","v":0},{"$f":"IF(J81=0,0,IF(J81<30,VLOOKUP(J81,Mach_Costs,5)*C81,VLOOKUP(J81,Mach_Costs,14)*C81))","v":0},{"$f":"IF(J81=0,0,IF(J81<30,VLOOKUP(J81,Mach_Costs,7)*C81,VLOOKUP(J81,Mach_Costs,16)*C81))","v":0},null,null,null,null,null,null,null,null,null,null,null,null,null,null,null,""]
[{"$f":"Rates!E16-1","v":0.25},"UNALLOCATED LABOR(HRS./AC.)",null,{"$f":"IF(A82>0,ROUND(SUM($D$78:$D$81)*(A82),2),ROUND(SUM($D$78:$D$81)*(Rates!$E$16-1),2))","v":0.26}]
[null,"SUB-TOTAL PRE-HARVEST",null,{"$f":"SUM(D77:D82)","v":1.29},{"$f":"SUM(E77:E81)","v":0.93},{"$f":"SUM(F77:F81)","v":10.92},{"$f":"SUM(G77:G81)","v":6.1},{"$f":"SUM(H77:H81)","v":9.39},null,0,"Diesel Fuel Adjustment Price",null,null,{"$f":"IF(J83=0,1,J83/Rates!E7)","v":1}]
["HARVEST"]
[null,{"$f":"IF(J85=0,\" \",VLOOKUP(J85,Mach_Costs,2))","v":" "},null,{"$f":"IF(J85=0,0,ROUND(E85*Rates!$E$15,2))","v":0},{"$f":"IF(J85=0,0,IF(J85<30,C85,VLOOKUP(J85,Mach_Costs,9)*C85))","v":0},{"$f":"IF(J85=0,0,IF(J85<30,VLOOKUP(J85,Mach_Costs,4)*C85,VLOOKUP(J85,Mach_Costs,13)*C85))*$N$83","v":0},{"$f":"IF(J85=0,0,IF(J85<30,VLOOKUP(J85,Mach_Costs,5)*C85,VLOOKUP(J85,Mach_Costs,14)*C85))","v":0},{"$f":"IF(J85=0,0,IF(J85<30,VLOOKUP(J85,Mach_Costs,7)*C85,VLOOKUP(J85,Mach_Costs,16)*C85))","v":0},null,null,null,null,null,null,null,null,null,null,null,null,null,null,null,""]
[null,{"$f":"IF(J86=0,\" \",VLOOKUP(J86,Mach_Costs,2))","v":" "},null,{"$f":"IF(J86=0,0,ROUND(E86*Rates!$E$15,2))","v":0},{"$f":"IF(J86=0,0,IF(J86<30,C86,VLOOKUP(J86,Mach_Costs,9)*C86))","v":0},{"$f":"IF(J86=0,0,IF(J86<30,VLOOKUP(J86,Mach_Costs,4)*C86,VLOOKUP(J86,Mach_Costs,13)*C86))*$N$83","v":0},{"$f":"IF(J86=0,0,IF(J86<30,VLOOKUP(J86,Mach_Costs,5)*C86,VLOOKUP(J86,Mach_Costs,14)*C86))","v":0},{"$f":"IF(J86=0,0,IF(J86<30,VLOOKUP(J86,Mach_Costs,7)*C86,VLOOKUP(J86,Mach_Costs,16)*C86))","v":0}]
[{"$f":"Rates!E16-1","v":0.25},"UNALLOCATED LABOR(HRS./AC.)",null,{"$f":"IF(A87>0,ROUND(SUM($D$85:$D$86)*(A87),2),ROUND(SUM($D$85:$D$86)*(Rates!$E$16-1),2))","v":0}]
[null,"SUB-TOTAL HARVEST",null,{"$f":"SUM(D85:D87)","v":0},{"$f":"SUM(E85:E87)","v":0},{"$f":"SUM(F85:F87)","v":0},{"$f":"SUM(G85:G87)","v":0},{"$f":"SUM(H85:H87)","v":0},null,null,null,null,null,null,null,null,null,null,null,null,null,null,null,""]
[]
[null,null,null,null,null,{"$f":"IF(J83=0,Rates!E7,J83)","v":2.4},"Diesel Fuel"]
[null,null,null,null,null,null,null,null,null,null,null,null,null,null,null,null,null,null,null,null,null,null,null,""]
[null,null,null,null,null,null,null,null,null,null,"",null,null,null,null,null,null,null,"",null,null,null,null,""]
[null,"CHEMICAL USE ASSUMPTIONS",null,null,null,null,null,null,null,null,"","",null,null,null,null,null,null,""]
[null,null,"% of",null,null," PRICE OR","TOTAL",null,null,"CHEM","",null,null,null,null,null,null,null,"",null,null,null,null,""]
["TYPE","Trade Name","Acres","UNIT","QUANTITY","COST/UNIT","PER ACRE","MONTH",null,"Codes",null,"HERBICIDE","INSECTICIDE","FUNGICIDE"]
[{"$f":"IF(J96=0,\" \",IF(VLOOKUP(J96,Chem_P,2)=\"HERBICIDE\",\"H\",IF(VLOOKUP(J96,Chem_P,2)=\"Insecticide\",\"I\",IF(VLOOKUP(J96,Chem_P,2)=\"Fungicide\",\"F\",IF(VLOOKUP(J96,Chem_P,2)=\"Nematicide\",\"N\",\" \")))))","v":" "},{"$f":"IF(J96=0,\" \",VLOOKUP(J96,Chem_P,3))","v":" "},null,{"$f":"IF(J96=0,\" \",VLOOKUP(J96,Chem_P,6))","v":" "},null,{"$f":"IF(J96=0,\" \",K96)","v":" "},{"$f":"IF(J96=0,\" \",ROUND(IF(C96>0,(C96*E96*F96),(E96*F96)),2))","v":" "},null,null,null,{"$f":"IF(VLOOKUP(J96,Chem_P,5)=\"GAL\",IF(VLOOKUP(J96,Chem_P,6)=\"PT\",VLOOKUP(J96,Chem_P,9)/8,IF(VLOOKUP(J96,Chem_P,6)=\"QT\",VLOOKUP(J96,Chem_P,9)/4,IF(VLOOKUP(J96,Chem_P,6)=\"OZ\",VLOOKUP(J96,Chem_P,9)/128,IF(VLOOKUP(J96,Chem_P,6)=\"LB\",VLOOKUP(J96,Chem_P,9)/8.3,VLOOKUP(J96,Chem_P,9))))),IF(VLOOKUP(J96,Chem_P,5)=\"LB\",IF(VLOOKUP(J96,Chem_P,6)=\"PT\",VLOOKUP(J96,Chem_P,9)/0.9639,IF(VLOOKUP(J96,Chem_P,6)=\"QT\",VLOOKUP(J96,Chem_P,9)/0.4819,IF(VLOOKUP(J96,Chem_P,6)=\"OZ\",VLOOKUP(J96,Chem_P,9)/16,IF(VLOOKUP(J96,Chem_P,6)=\"GAL\",VLOOKUP(J96,Chem_P,9)/0.1205,VLOOKUP(J96,Chem_P,9))))),IF(VLOOKUP(J96,Chem_P,5)=\"OZ\",IF(VLOOKUP(J96,Chem_P,6)=\"PT\",VLOOKUP(J96,Chem_P,9),IF(VLOOKUP(J96,Chem_P,6)=\"QT\",VLOOKUP(J96,Chem_P,9),IF(VLOOKUP(J96,Chem_P,6)=\"GAL\",VLOOKUP(J96,Chem_P,9),IF(VLOOKUP(J96,Chem_P,6)=\"LB\",VLOOKUP(J96,Chem_P,9)/0.0625,VLOOKUP(J96,Chem_P,9))))),VLOOKUP(J96,Chem_P,9))))","v":{"$error":"#N/A"}},{"$f":"IF($J96=0,\" \",IF(VLOOKUP($J96,Chem_P,2)=L$95,$G96,IF(VLOOKUP($J96,Chem_P,2)=L$94,$G96,\" \")))","v":" "},{"$f":"IF($J96=0,\" \",IF(VLOOKUP($J96,Chem_P,2)=M$95,$G96,IF(VLOOKUP($J96,Chem_P,2)=M$94,$G96,\" \")))","v":" "},{"$f":"IF($J96=0,\" \",IF(VLOOKUP($J96,Chem_P,2)=N$95,$G96,IF(VLOOKUP($J96,Chem_P,2)=N$94,$G96,\" \")))","v":" "}]
[{"$f":"IF(J97=0,\" \",IF(VLOOKUP(J97,Chem_P,2)=\"HERBICIDE\",\"H\",IF(VLOOKUP(J97,Chem_P,2)=\"Insecticide\",\"I\",IF(VLOOKUP(J97,Chem_P,2)=\"Fungicide\",\"F\",IF(VLOOKUP(J97,Chem_P,2)=\"Nematicide\",\"N\",\" \")))))","v":"H"},{"$f":"IF(J97=0,\" \",VLOOKUP(J97,Chem_P,3))","v":"2, 4-D Amine"},0.25,{"$f":"IF(J97=0,\" \",VLOOKUP(J97,Chem_P,6))","v":"PT"},2,2.0350000000000001,{"$f":"IF(J97=0,\" \",ROUND(IF(C97>0,(C97*E97*F97),(E97*F97)),2))","v":1.02},null,null,501,{"$f":"IF(VLOOKUP(J97,Chem_P,5)=\"GAL\",IF(VLOOKUP(J97,Chem_P,6)=\"PT\",VLOOKUP(J97,Chem_P,9)/8,IF(VLOOKUP(J97,Chem_P,6)=\"QT\",VLOOKUP(J97,Chem_P,9)/4,IF(VLOOKUP(J97,Chem_P,6)=\"OZ\",VLOOKUP(J97,Chem_P,9)/128,IF(VLOOKUP(J97,Chem_P,6)=\"LB\",VLOOKUP(J97,Chem_P,9)/8.3,VLOOKUP(J97,Chem_P,9))))),IF(VLOOKUP(J97,Chem_P,5)=\"LB\",IF(VLOOKUP(J97,Chem_P,6)=\"PT\",VLOOKUP(J97,Chem_P,9)/0.9639,IF(VLOOKUP(J97,Chem_P,6)=\"QT\",VLOOKUP(J97,Chem_P,9)/0.4819,IF(VLOOKUP(J97,Chem_P,6)=\"OZ\",VLOOKUP(J97,Chem_P,9)/16,IF(VLOOKUP(J97,Chem_P,6)=\"GAL\",VLOOKUP(J97,Chem_P,9)/0.1205,VLOOKUP(J97,Chem_P,9))))),IF(VLOOKUP(J97,Chem_P,5)=\"OZ\",IF(VLOOKUP(J97,Chem_P,6)=\"PT\",VLOOKUP(J97,Chem_P,9),IF(VLOOKUP(J97,Chem_P,6)=\"QT\",VLOOKUP(J97,Chem_P,9),IF(VLOOKUP(J97,Chem_P,6)=\"GAL\",VLOOKUP(J97,Chem_P,9),IF(VLOOKUP(J97,Chem_P,6)=\"LB\",VLOOKUP(J97,Chem_P,9)/0.0625,VLOOKUP(J97,Chem_P,9))))),VLOOKUP(J97,Chem_P,9))))","v":2.0350000000000001},{"$f":"IF($J97=0,\" \",IF(VLOOKUP($J97,Chem_P,2)=L$95,$G97,IF(VLOOKUP($J97,Chem_P,2)=L$94,$G97,\" \")))","v":1.02}," "," ",null,null,null,null,"",null,null,null,null,""]
["H",{"$f":"IF(J98=0,\" \",VLOOKUP(J98,Chem_P,3))","v":"Banvel"},0.25,{"$f":"IF(J98=0,\" \",VLOOKUP(J98,Chem_P,6))","v":"PT"},1,11.61,{"$f":"IF(J98=0,\" \",ROUND(IF(C98>0,(C98*E98*F98),(E98*F98)),2))","v":2.9},null,null,514,{"$f":"IF(VLOOKUP(J98,Chem_P,5)=\"GAL\",IF(VLOOKUP(J98,Chem_P,6)=\"PT\",VLOOKUP(J98,Chem_P,9)/8,IF(VLOOKUP(J98,Chem_P,6)=\"QT\",VLOOKUP(J98,Chem_P,9)/4,IF(VLOOKUP(J98,Chem_P,6)=\"OZ\",VLOOKUP(J98,Chem_P,9)/128,IF(VLOOKUP(J98,Chem_P,6)=\"LB\",VLOOKUP(J98,Chem_P,9)/8.3,VLOOKUP(J98,Chem_P,9))))),IF(VLOOKUP(J98,Chem_P,5)=\"LB\",IF(VLOOKUP(J98,Chem_P,6)=\"PT\",VLOOKUP(J98,Chem_P,9)/0.9639,IF(VLOOKUP(J98,Chem_P,6)=\"QT\",VLOOKUP(J98,Chem_P,9)/0.4819,IF(VLOOKUP(J98,Chem_P,6)=\"OZ\",VLOOKUP(J98,Chem_P,9)/16,IF(VLOOKUP(J98,Chem_P,6)=\"GAL\",VLOOKUP(J98,Chem_P,9)/0.1205,VLOOKUP(J98,Chem_P,9))))),IF(VLOOKUP(J98,Chem_P,5)=\"OZ\",IF(VLOOKUP(J98,Chem_P,6)=\"PT\",VLOOKUP(J98,Chem_P,9),IF(VLOOKUP(J98,Chem_P,6)=\"QT\",VLOOKUP(J98,Chem_P,9),IF(VLOOKUP(J98,Chem_P,6)=\"GAL\",VLOOKUP(J98,Chem_P,9),IF(VLOOKUP(J98,Chem_P,6)=\"LB\",VLOOKUP(J98,Chem_P,9)/0.0625,VLOOKUP(J98,Chem_P,9))))),VLOOKUP(J98,Chem_P,9))))","v":11.61},2.9," "," ",null,null,null,null,"",null,null,null,null,""]
["H","Remedy Ultra",0.1,"QT",1,19.2,1.92,null,null,568,{"$f":"IF(VLOOKUP(J99,Chem_P,5)=\"GAL\",IF(VLOOKUP(J99,Chem_P,6)=\"PT\",VLOOKUP(J99,Chem_P,9)/8,IF(VLOOKUP(J99,Chem_P,6)=\"QT\",VLOOKUP(J99,Chem_P,9)/4,IF(VLOOKUP(J99,Chem_P,6)=\"OZ\",VLOOKUP(J99,Chem_P,9)/128,IF(VLOOKUP(J99,Chem_P,6)=\"LB\",VLOOKUP(J99,Chem_P,9)/8.3,VLOOKUP(J99,Chem_P,9))))),IF(VLOOKUP(J99,Chem_P,5)=\"LB\",IF(VLOOKUP(J99,Chem_P,6)=\"PT\",VLOOKUP(J99,Chem_P,9)/0.9639,IF(VLOOKUP(J99,Chem_P,6)=\"QT\",VLOOKUP(J99,Chem_P,9)/0.4819,IF(VLOOKUP(J99,Chem_P,6)=\"OZ\",VLOOKUP(J99,Chem_P,9)/16,IF(VLOOKUP(J99,Chem_P,6)=\"GAL\",VLOOKUP(J99,Chem_P,9)/0.1205,VLOOKUP(J99,Chem_P,9))))),IF(VLOOKUP(J99,Chem_P,5)=\"OZ\",IF(VLOOKUP(J99,Chem_P,6)=\"PT\",VLOOKUP(J99,Chem_P,9),IF(VLOOKUP(J99,Chem_P,6)=\"QT\",VLOOKUP(J99,Chem_P,9),IF(VLOOKUP(J99,Chem_P,6)=\"GAL\",VLOOKUP(J99,Chem_P,9),IF(VLOOKUP(J99,Chem_P,6)=\"LB\",VLOOKUP(J99,Chem_P,9)/0.0625,VLOOKUP(J99,Chem_P,9))))),VLOOKUP(J99,Chem_P,9))))","v":19.2},1.92," "," "]
[" "," ",null," ",null," "," ",null,null,null,{"$error":"#N/A"}," "," "," "]
[" "," ",null," ",null," "," ",null,null,null,{"$error":"#N/A"}," "," "," "]
[" "," ",null," ",null," "," ",null,null,null,{"$error":"#N/A"}," "," "," ",null,null,null,null,"",null,null,null,null,""]
[" "," ",null," ",null," "," ",null,null,null,{"$error":"#N/A"}," "," "," ",null,null,null,null,"",null,null,null,null,""]
[null,null,null,null,null,null,null,null,null,null,{"$error":"#N/A"}," "," "," ",null,null,null,null,"",null,null,null,null,""]
[{"$f":"IF(J105=0,\" \",\"Notes\")","v":"Notes"},{"$f":"IF(J105=0,\" \",VLOOKUP(J105,Chem_P,2))","v":"Chemical Type: H = Herbicide; I = Insecticide; F = Fungicide; G = Growth Regulator; X = Nemacides/Fumigants"},null,null,null,null,null,null,null,1013,null,null,{"$f":"IF($J105=0,\" \",IF(VLOOKUP($J105,Chem_P,2)=M$141,$G105,IF(VLOOKUP($J105,Chem_P,2)=M$140,$G105,\" \")))","v":" "},{"$f":"IF($J105=0,\" \",IF(VLOOKUP($J105,Chem_P,2)=N$141,$G105,IF(VLOOKUP($J105,Chem_P,2)=N$140,$G105,\" \")))","v":" "},null,null,null,null,"",null,null,null,null,""]
[null,{"$f":"IF(J106=0,\" \",VLOOKUP(J106,Chem_P,2))","v":"Weed control depends on weed infestation."},null,null,null,null,null,null,null,1004,"",{"$f":"SUM(L96:L104)","v":5.84},{"$f":"SUM(M98:M103)","v":0},{"$f":"SUM(N98:N103)","v":0},null,null,null,null,"",null,null,null,null,""]
[null,null,null,null,null,null,null,null,null,null,"","",null,null,null,null,null,null,"",null,null,null,null,""]
["Trade and brand names are used only for the purpose of providing information.  Virginia Cooperative Extension does not guarantee or warrant"]
["the standard of any product named to the exclusion of others which also may be suitable."]
[]
[]
[]
[]
[]
[]
[]
[]
[]
[]
[]
[]
[]
[]
[]
[]
[]
[]
[]
[]
[]
[]
[]
[]
[]
[]
[]
[]
[null,null,null,null,null,null,null,null,null,null,"","",null,null,null,null,null,null,"",null,null,null,null,""]
[null,null,null,null,null,null,null,null,null,null,"",null,null,null,null,null,null,null,"",null,null,null,null,""]
[null,null,null,null,null,null,null,null,null,null,"",null,null,null,null,null,null,null,"",null,null,null,null,""]
[null,null,null,null,null,null,null,null,null,null,"",null,null,null,null,null,null,null,"",null,null,null,null,""]
[null,"Finpack Budget Summary",null,null,null,null,null,null,null,null,"",null,null,null,null,null,null,null,"",null,null,null,null,""]
[null,{"$f":"D3","v":"Pasture Maintenance"},{"$f":"+D10","v":"Grazing Days"},{"$f":"+E10","v":300}]
[null,"Price",null,{"$f":"+F10","v":0.5},null,null,null,null,null,null,"","",null,null,null,null,null,null,"",null,null,null,null,""]
[null,"Crop Value",null,{"$f":"(D143*D144)/B4","v":150},null,null,null,null,null,null,"","",null,null,null,null,null,null,"",null,null,null,null,""]
[null,"Misc. Inc.",null,{"$f":"G147-G145","v":0},null,null,null,null,null,null,"","",null,null,null,null,null,null,"",null,null,null,null,""]
[null,"Gross Income",null,{"$f":"G12/B4","v":150},null,null,null,null,null,null,"","",null,null,null,null,null,null,"",null,null,null,null,""]
[null,"Direct Costs",null,null,null,null,null,null,null,null,"","",null,null,null,null,null,null,"",null,null,null,null,""]
[null,">Seed",null,{"$f":"SUM(G15:G15)/B4","v":8.693878900208464},null,null,null,null,null,null,"","",null,null,null,null,null,null,""]
[null,">Fertilizer & Lime",null,{"$f":"SUM(G18:G22)/B4","v":31.33},null,null,null,null,null,null,"","",null,null,null,null,null,null,""]
[null,">Chemicals",null,{"$f":"SUM(G23:G26)/B4","v":5.84},null,null,null,null,null,null,"","",null,null,null,null,null,null,""]
[null,">Crop Insurance",null,{"$f":"G31/B4","v":6.41},null,null,null,null,null,null,null,null,null,null,null,null,null,null,""]
[null,">Drying Fuel",null,{"$f":"G46","v":0}]
[null,">Irrigation"]
[null,">Packaging & Supplies"]
[null,">Custom Hire"]
[null,">Hired Labor"]
[null,"Total Direct Cost",null,{"$f":"SUM(D149:D157)","v":52.273878900208459}]
[null,"Labor Hours",null,{"$f":"(SUM(E29:E29)+SUM(E43:E43))/3","v":0.43}]

{"sheet":"Chemicals","index":1,"n_rows":600,"n_cols":11,"rows_kept":600,"cut":false,"hidden":false,"merged":[]}
["ESTIMATED 2017/2018 PRICES FOR FARM CHEMICALS "]
["(USED IN PREPARING THE ENTERPRISE BUDGETS FOR 2018)"]
[]
[null,null,"PRODUCT",null,null,"BUD",null,null,"AVERAGE"]
["CODE","TYPE ","NAME","MANUFACTURER","UNIT","GET","PRICE 1","PRICE 2","PRICE","INGREDIENTS","Comments"]
[0]
[1,"BACTERICIDE","Agri-mycin 17","Nufarm Americas","LB ","OZ",11.76,12.6,{"$f":"ROUND(IF(G7=0,H7,IF(H7=0,G7,AVERAGE(G7,H7))),2)","v":12.18},"streptomycin"]
[2,"BACTERICIDE","MYCOSHIELD A T","Nufarm","LB","OZ",12.5,null,{"$f":"ROUND(IF(G8=0,H8,IF(H8=0,G8,AVERAGE(G8,H8))),2)","v":12.5},"oxytetracycline"]
[3,"BACTERICIDE","Ag Streptomycin","MANA Crop Protection","LB","OZ",10.6,10.5,{"$f":"ROUND(IF(G9=0,H9,IF(H9=0,G9,AVERAGE(G9,H9))),2)","v":10.55},"streptomycin"]
[10,"DEFOLIANT"]
[11,"DEFOLIANT","CottonQuik","Nufarm Ag Products","GAL","QT",38.72,{"$f":"4.52*8","v":36.159999999999997},{"$f":"ROUND(IF(G11=0,H11,IF(H11=0,G11,AVERAGE(G11,H11))),2)","v":37.44},"ethephon+AMADS"]
[11,"DEFOLIANT","First Pick","Nufarm Ag Products","GAL","QT",28.4,null,28.4,"ethephon+AMADS"]
[12,"DEFOLIANT","Def 6","Bayer Crop Science","GAL","PT",66,{"$f":"10.54*8","v":84.32},75.16,"S,S,S-Tributyle phosphorotrithioate"]
[13,"DEFOLIANT","Dropp SC","Bayer Crop Science","GAL","OZ",{"$f":"1.6*128","v":204.8},null,204.8,"thidiazuron"]
[14,"DEFOLIANT","FreeFall SC","Nufarm Ag Products","GAL","OZ",{"$f":"1.34*128","v":171.52},{"$f":"1.5*128","v":192},181.76,"thidiazuron"]
[15,"DEFOLIANT","Pix Plus","Arysta Life Science","GAL","OZ",51.53,49.92,50.73,"mepiquat chloride"]
[17,"DEFOLIANT","Folex 6EC","Amvec Chemical","GAL","PT",{"$f":"8.99*8","v":71.92},{"$f":"10.54*8","v":84.32},78.12,"S,S,S-Tributyle phosphorotrithioate"]
[18,"DEFOLIANT","Harvade 5F","Crompton","GAL","PT",54.86,76.8,65.83,"dimethipin"]
[19,"DEFOLIANT","thidiazuron","Various","GAL","OZ",196,{"$f":"1.5*128","v":192},194,"thidiazuron"]
[21,"DEFOLIANT","Ginstar EC","Bayer Crop Science","GAL","PT",{"$f":"26.44*8","v":211.52},{"$f":"238.88","v":238.88},225.2,"thidiazuron+diuron"]
[22,"DEFOLIANT","Adios","Arysta Life Science","GAL","OZ",{"$f":"1.38*128","v":176.64},{"$f":"1.29*128","v":165.12},170.88,"thidiazuron+diuron"]
[50,"FUMIGANT"]
[51,"FUMIGANT"]
[52,"FUMIGANT"]
[53,"FUMIGANT","Chloropicrin",null,"LB","LB",3.1,3.2,{"$f":"ROUND(IF(G25=0,H25,IF(H25=0,G25,AVERAGE(G25,H25))),2)","v":3.15},"chloropicrin"]
[54,"FUMIGANT","Inline 60/33","Dow AgroSciences","GAL","GAL",33,35,34,"dichloropropene+chloropicrin"]
[55,"FUMIGANT","Metam CLR 42%","Taminco","GAL","GAL",null,4,4,"Sodium mythyldithiocarbamate"]
[55.5,"FUMIGANT","Metam KLR 54%","Taminco","GAL","GAL",null,5,5,"Potassium N-mythyldithiocarbamate"]
[56,"FUMIGANT","Mocap EC6","Bayer Crop Science","GAL","GAL",92,95,93.5,"ethoprop"]
[56.5,"FUMIGANT","Mocap 15G","Bayer Crop Science","LB","LB",3,null,3,"ethoprop"]
[57.25,"FUMIGANT","MIDAS 25:75","Arysta Life Science","LB","LB",6.75,7,6.88,"indomethane + chloropicrin"]
[58.1,"FUMIGANT","Pic C-60",null,"LB","LB",3.4,3.78,3.59,"dichloropropene+chloropicrin"]
[58.2,"FUMIGANT","Pic Plus",null,"GAL","Gal",{"$f":"191.7/4.5","v":42.599999999999994},null,42.6,"dichloropropene+chloropicrin"]
[58.5,"FUMIGANT","Profume","Dow AgroSciences","LB","LB",5.25,null,5.25,"sulfuryl fluoride"]
[58.8,"FUMIGANT","Trifecta",null,"LB","LB",null,null,0,"Telone II, Chloropicrin, DMDS"]
[59.2,"FUMIGANT","Telone C-17","Dow AgroSciences","GAL","GAL",19.5,23,21.25,"dichloropropene+chloropicrin"]
[59.4,"FUMIGANT","Telone C-35","Dow AgroSciences","GAL","GAL",29.2,40,34.6,"dichloropropene+chloropicrin"]
[59.6,"FUMIGANT","Telone II","Dow AgroSciences","GAL","GAL",20.48,27.2,23.84,"dichloropropene"]
[60,"FUMIGANT","Temik 15G","Bayer Crop Science","LB","LB",3.95,3.8,3.88,"aldicarb"]
[61,"FUMIGANT","Meymik 15G","AgLogic LLC","LB","LB",3.95,3.8,3.88,"aldicarb"]
[63,"FUMIGANT","Vapam HL 42%","Amvec Chemical","GAL","GAL",4.3499999999999996,5.05,4.7,"metam-sodium"]
[64,"FUMIGANT","Paladin",null,"GAL","GAL",null,null,0,"Dimethyl Disulfide (DMDS)"]
[65,"FUMIGANT","Paladin Pic",null,"LB","LB",2.75,null,2.75,"Dimethyl Disulfide + chloropicrin"]
[100,"FUNGICIDE"]
[101,"FUNGICIDE","Abound FL","Syngenta","GAL","OZ",225.28,269,{"$f":"ROUND(IF(G45=0,H45,IF(H45=0,G45,AVERAGE(G45,H45))),2)","v":247.14},"azoxystrobin"]
[101.5,"FUNGICIDE","Absolute 500SC","Bayer Crop Science","GAL","OZ",255.28,{"$f":"53.42*8","v":427.36},341.32,"tebuconazole + trifloxystrobin"]
[102,"FUNGICIDE","Acrobat WP",null,"LB","OZ",18.690000000000001,24.5,21.6,"dimethomorph + mancozeb"]
[103,"FUNGICIDE","Actigard 50WG","Syngenta","OZ","OZ",28,null,28,"acibenzolar-S-methyl"]
[103.5,"FUNGICIDE","AgriTin","Nufarm Americas","OZ","OZ",null,null,0,"triphenyltin hydroxide"]
[104,"FUNGICIDE","Aliette","Bayer Crop Science","LB","LB",12,null,12,"fosetyl al tris phosphonate"]
[104.5,"FUNGICIDE","Alto 100SL","Syngenta","GAL","OZ",null,null,0,"cyproconazole"]
[105,"FUNGICIDE","Apron Maxx","Syngenta","GAL","OZ",null,null,0,"Fludioxonil+Mefenoxam"]
[105.5,"FUNGICIDE","Artisan","Nichino America","GAL","OZ",122.88,127.99,125.44,"Tilt + Moncut"]
[106,"FUNGICIDE","Basicop","Griffin","LB","LB",null,null,0,"fixed copper"]
[107,"FUNGICIDE","Baytan 30 Flowable","Bayer Crop Science","LB","OZ",60.55,68.25,64.400000000000006,"triadimefon"]
[108,"FUNGICIDE",null,null,null,null,null,null,0,"benomyl"]
[109,"FUNGICIDE","Botran 5F","Gowan Chemical","LB","LB",null,null,0,"dicloran"]
[110,"FUNGICIDE","Bravo - Weather Stik","Syngenta","GAL","PT",35.44,52.48,43.96,"chlorothalonil"]
[110.1,"FUNGICIDE","Bravo 720","Syngenta","GAL","PT",null,41,41,"chlorothalonil"]
[110.2,"FUNGICIDE","Bravo S","Helena Chemical","GAL","PT",null,29,29,"chlorothalonil"]
[110.3,"FUNGICIDE","Bravo Ultrex","Syngenta","LB","LB",5.83,6,5.92,"chlorothalonil"]
[111,"FUNGICIDE","Bumper 41.8EC","MANA Crop Protection","GAL","OZ",274.19,301.39999999999998,287.8,"propiconazole"]
[112,"FUNGICIDE","Cabrio","BASF","LB","OZ",29.67,32.85,31.26,"pyraclostrobin"]
[113,"FUNGICIDE","Caramba",null,"GAL","OZ",146.63999999999999,156.36000000000001,151.5,"metconazol"]
[115,"FUNGICIDE","Captan 4L","Drexel / Red Eagle","GAL","PT",20.16,25,22.58,"captan"]
[115.5,"FUNGICIDE","Captan 80WDG","Drexel / Red Eagle","LB","LB",3.35,3.6,3.48,"captan"]
[116,"FUNGICIDE","Champ Formula 2","Nufarm Americas","GAL","PT",37.380000000000003,null,37.380000000000003,"fixed copper"]
[117,"FUNGICIDE","Clorox","Various","GAL","PT",null,3,3,"sodium hypoclorite"]
[117.5,"FUNGICIDE","Convoy 3.8F","Nichino America","GAL","OZ",{"$f":"0.31*128","v":39.68},null,39.68,"flutolanil"]
[118,"FUNGICIDE","Copper Sulphate",null,"GAL","GAL",60.99,null,60.99]
[119,"FUNGICIDE","Cuprofix Ultra 40 Dis","United Phorphorus","lB","LB",3.46,3.55,3.51,"fixed copper"]
[120,"FUNGICIDE","Curzate M-8","DuPont","LB","OZ",null,null,0,"cymoxanil + mancozeb"]
[121,"FUNGICIDE","Dithane M45","Dow AgroSciences","LB","LB",2.75,null,2.75,"mancozeb"]
[122,"FUNGICIDE","Dithane F45","Dow AgroSciences","GAL","QT",31.24,32.85,32.049999999999997,"mancozeb"]
[122.5,"FUNGICIDE","Domark 230ME","Valent","GAL","OZ",265.54000000000002,280.32,272.93,"tebuconazole"]
[123,"FUNGICIDE","Echo 720","Sipcam Agro USA","GAL","PT",null,34,34,"chlorothalonil"]
[123.5,"FUNGICIDE","Echo 90DF","Sipcam Agro USA","lB","LB",null,null,0,"chlorothalonil"]
[124,"FUNGICIDE","Elevate","Arysta Life Science","LB","LB",36.21,36.24,36.229999999999997,"fenhexamid"]
[124.5,"FUNGICIDE","Endura 70WP","Syngenta","OZ","OZ",4.37,4.38,4.38,"Boscalid"]
[125,"FUNGICIDE","Equus","ADAMA","GAL","PT",33.94,34,33.97,"chlorothalonil"]
[125.5,"FUNGICIDE","Evito 480SC","Arysta Life Science","GAL","OZ",null,null,0,"fluoxastrobin"]
[126,"FUNGICIDE","Ferbam Granuflo","Taminco","LB","LB",null,{"$f":"6/0.773","v":7.7619663648124186},7.76,"ferric dimethyldithiocarbamate"]
[127,"FUNGICIDE","Flint","Bayer Crop Science","OZ","OZ",10.42,null,10.42,"trifloxystrobin"]
[128,"FUNGICIDE","Flouronil","Nufarm Americas","LB","LB",null,null,0,"mefenoxam + chlorothalonil"]
[129,"FUNGICIDE","Folicur 3.6F ","Bayer Crop Science","GAL","OZ",{"$f":"1.08*128","v":138.24},280.32,209.28,"tebuconazole"]
[129.5,"FUNGICIDE","Tebuconazol 3.6F","Amtide, LLC","GAL","OZ",38.200000000000003,43.45,40.83,"tebuconazole"]
[130,"FUNGICIDE","Forum","BASF","GAL","OZ",217.09,237.5,227.3,"dimethomorph"]
[130.5,"FUNGICIDE","Gavel","Gowan","LB","OZ",null,null,0,"zoxamide+mancozeb"]
[131,"FUNGICIDE","Gem","Bayer Crop Science","OZ","OZ",7.2,7.26,7.23,"trifloxystrobin"]
[132,"FUNGICIDE","Headline EC","BASF","GAL","OZ",336.64,377.6,357.12,"pyraclostrobin"]
[133,"FUNGICIDE","Indar 75WSP","Dow AgroSciences","LB","OZ",null,null,0,"fenbuconazole"]
[133.5,"FUNGICIDE","Indar 2F","Dow AgroSciences","GAL","OZ",257,null,257,"fenbuconazole"]
[134,"FUNGICIDE","Kocide 3000","DuPont","LB","LB",6,null,6,"copper hydroxide"]
[134.5,"FUNGICIDE","K-Pam","Amvec Chemical","GAL","GAL",null,null,0,"metam potassium"]
[135,"FUNGICIDE","Laredo 25EC","Dow AgroSciences","GAL","OZ",null,null,0,"myclobutanil"]
[136,"FUNGICIDE","Maneb 75DF","United Phorphorus","LB","LB",3.24,null,3.24,"maneb"]
[137,"FUNGICIDE","Manex","Dupont","GAL","PT",18.72,18.670000000000002,18.7,"maneb"]
[138,"FUNGICIDE","Manex II","Griffin","GAL","QT",null,null,0,"mancozeb"]
[138.5,"FUNGICIDE","ManKocide","Griffin","LB","LB",null,null,0,"mancozeb + copper hydroxide"]
[140,"FUNGICIDE","Manzate 75DF","Griffin","LB","LB",4.76,4.96,4.8600000000000003,"mancozeb"]
[140.5,"FUNGICIDE","Manzate Flowable","DuPont","GAL","QT",{"$f":"3.7*8","v":29.6},32.799999999999997,31.2,"mancozeb"]
[140.6,"FUNGICIDE","Manzate Pro Stick","UPI","LB","LB",3.4,3.95,3.68,"mancozeb"]
[141,"FUNGICIDE","Maxim","Syngenta","LB","OZ",3.65,3.85,3.75,"fludioxonil"]
[141.5,"FUNGICIDE","Mertect 340-F","Syngenta","GAL","OZ",339,378.88,358.94,"thiabendazole"]
[141.6,"FUNGICIDE","Messenger","Eden Bioscience","LB","OZ",null,null,0,"harpin protein"]
[142,"FUNGICIDE","MetaStar 2E",null,"GAL","PT",291,null,291,"metalaxyl"]
[142.5,"FUNGICIDE","Microthiol","UPI","LB","LB",1.59,1.75,1.67,"micronized wettable sulfur"]
[143,"FUNGICIDE","MonCoat MZ","UAP-Platte Chemical","LB","LB",25.09,26.75,25.92,"flutolanil + mancozeb"]
[143.5,"FUNGICIDE","Moncut 70DF","Gowan","LB","LB",28.58,32.81,{"$f":"ROUND(IF(G109=0,H109,IF(H109=0,G109,AVERAGE(G109,H109))),2)","v":30.7},"flutolanil"]
[144,"FUNGICIDE"]
[144.5,"FUNGICIDE","Rally 40WSP","Dow AgroSciences","OZ","OZ",2.86,2.9,2.88,"myclobutanil"]
[145,"FUNGICIDE","Omega 500","Syngenta","PT","OZ",290,325,307.5,"fluazinam"]
[146,"FUNGICIDE","Orbit","Syngenta","QT","OZ",{"$f":"2.75*32","v":88},null,88,"propiconazole"]
[147,"FUNGICIDE","Penncozeb","UPI","LB","LB",3.02,3.25,3.14,"mancozeb"]
[147.5,"FUNGICIDE",null,null,null,null,null,null,0]
[148,"FUNGICIDE","Polyram 80 DF","UAP-Platte Chemical","LB","LB",2.63,null,2.63,"metiram"]
[148.5,"FUNGICIDE","Presidio","Valent Chemical","QT","OZ",255,null,255,"fluopicolide"]
[148.80000000000001,"FUNGICIDE","Prevail","Chemtura","LB","LB",28.06,28.26,28.16,"carboxin + PCNB + metalaxyl"]
[149,"FUNGICIDE","Previcur Flex","Bayer Crop Science","GAL","PT",83,null,83,"propamocarb hydrochloride"]
[149.5,"FUNGICIDE","Pristine","BASF","OZ","OZ",2.99,{"$f":"375/120","v":3.125},3.06,"pyraclostrobin + boscalid"]
[150,"FUNGICIDE","Procure 480SC","Chemtura","QT","OZ",114.98,null,114.98,"triflumizole"]
[151,"FUNGICIDE","Propiconazole 41.8%","Amtide, LLC","GAL","OZ",78,null,78,"propiconazole"]
[151.5,"FUNGICIDE","ProPhyt","Helena Chemical","GAL","PT",41.09,42.73,41.91,"potassium phosphite"]
[152,"FUNGICIDE","Prosaro 421SC","Bayer Crop Science","GAL","OZ",585,712.96,648.98,"prothioconazole+tebuconazole"]
[152.5,"FUNGICIDE","Provost 433SC","Bayer Crop Science","GAL","OZ",202.24,311.04000000000002,256.64,"prothioconazole+tebuconazole"]
[153,"FUNGICIDE","Quadris","Syngenta","GAL","OZ",273.92,385.28,329.6,"azoxystrobin"]
[153.1,"FUNGICIDE","Quadris/Ridomil Gold","Syngenta","GAL","OZ",700,837.12,768.56,"azoxystrobin + mefenoxam"]
[153.19999999999999,"FUNGICIDE","Quadris Top","Syngenta","GAL","OZ",288.91000000000003,326.39999999999998,307.66000000000003,"azoxystrobin + chlorothalonil"]
[153.5,"FUNGICIDE","Quilt","Syngenta","GAL","OZ",140,null,140,"azoxystrobin + propiconazole"]
[153.6,"FUNGICIDE","Quilt Xcel","Syngenta","GAL","OZ",185,203.44,194.22,"azoxystrobin + propiconazole"]
[153.80000000000001,"FUNGICIDE","Quintec","Dow AgroSciences","OZ","OZ",2.87,3,2.94,"quinoxyfen"]
[154,"FUNGICIDE","Ranman","Summit Ag","GAL","OZ",825,null,825,"Cyazofamid"]
[155,"FUNGICIDE","Reason","Bayer Crop Science","GAL","OZ",{"$f":"1098/2.5","v":439.2},{"$f":"989/2.5","v":395.6},417.4,"fenamidone"]
[156,"FUNGICIDE","Revus","Syngenta","GAL","OZ",349,null,349,"Mandipropamid"]
[156.5,"FUNGICIDE","Revus Top","Syngenta","GAL","OZ",295,null,295,"Mandipropamid + Difenoconazole"]
[157,"FUNGICIDE","Ridomil 2E","Syngenta","GAL","PT",291,null,291,"metalaxyl"]
[157.1,"FUNGICIDE","Ridomil Gold 4EC","Syngenta","GAL","PT",{"$f":"104.77*8","v":838.16},821.76,829.96,"mefenoxam"]
[157.19999999999999,"FUNGICIDE","Ridomil Gold Bravo","Syngenta","GAL","PT",110.86,111.35,111.11,"mefenoxam + chlorothalonil"]
[157.30000000000001,"FUNGICIDE","Ridomil Gold Copper","Syngenta","LB","LB",14.18,14.27,14.23,"mefenoxam + copper hydroxide"]
[157.4,"FUNGICIDE","Ridomil Gold PC GR","Syngenta","LB","LB",5.08,6.45,5.77,"mefenoxam-PCNB"]
[157.5,"FUNGICIDE","Ridomil Gold MZ","Syngenta","LB","LB",14,14.98,14.49,"mefenoxam + mancozeb"]
[157.6,"FUNGICIDE","Ridomil Gold SL","Syngenta","GAL","OZ",625,704,664.5,"mefenoxam-"]
[159,"FUNGICIDE","Ronilan",null,"LB","LB",19,20,19.5,"vinclozolin"]
[160,"FUNGICIDE","Rovral","FMC","GAL","PT",92,{"$f":"14.8*8","v":118.4},105.2,"iprodione"]
[160.5,"FUNGICIDE","Nevado 4F","MANA Crop Protection","GAL","PT",162.85,{"$f":"17.83*8","v":142.63999999999999},152.75,"iprodione"]
[161,"FUNGICIDE","Rubigan EC","Gowan Company","QT","OZ",73.540000000000006,72.66,73.099999999999994,"fenarimol"]
[161.30000000000001,"FUNGICIDE","Scala","Bayer Crop Science","GAL","OZ",207.36,212.56,209.96,"pyrimethanil"]
[161.5,"FUNGICIDE","Cleary 3336","Cleary","LB","LB",null,null,0,"thiophanate-methyl"]
[162,"FUNGICIDE","Stellar 3.1EC","Valent","GAL","OZ",null,null,0,"fluopiolide+propamocarb hydrochloride"]
[163,"FUNGICIDE","Stratego YLD","Bayer Crop Science","GAL","OZ",498.52,547.84,523.17999999999995,"propiconazole + trifloxystrobin"]
[164,"FUNGICIDE","Sulfur 90WP","Georgia Gulf","LB","LB",0.44,null,0.44,"sulfur 90%"]
[165,"FUNGICIDE","Switch","Syngenta","LB","OZ",4.5,4.71,4.6100000000000003,"cyprodinil + fludioxonil"]
[166,"FUNGICIDE","Syllit FL","Aceto","GAL","PT",51,51.6,51.3,"dodine"]
[167,"FUNGICIDE","Tanos","Dupont ","LB","OZ",38.67,null,38.67,"famoxadone + cymoxanil"]
[167.5,"FUNGICIDE",null,null,null,null,null,null,0]
[168,"FUNGICIDE","Terraclor 2E",null,"GAL","PT",{"$f":"1.87*8","v":14.96},null,14.96,"PCNB"]
[168.5,"FUNGICIDE","Terraclor Super X 18.8G",null,"lB","OZ",2.82,3.28,3.05,"PCNB + Terrazole"]
[169,"FUNGICIDE","Terramaster 4EC","Chemtura","GAL","OZ",{"$f":"84.72*4","v":338.88},{"$f":"87*4","v":348},343.44,"Etridiazole"]
[170,"FUNGICIDE","Thiolux DF","Syngenta","LB","LB",null,null,0,"sulfur 80%"]
[172,"FUNGICIDE","Tilt 3.6EC","Syngenta","GAL","OZ",96,170.24,133.12,"propiconazole"]
[172.5,"FUNGICIDE","Tilt/Bravo","Syngenta","GAL","OZ",52.48,57.6,55.04,"propiconazole + chlorothalonil"]
[172.8,"FUNGICIDE",null,"Cheminova","OZ","OZ",null,2.5299999999999998,2.5299999999999998,"fluutriafol"]
[173,"FUNGICIDE","Topsin 4.5FL","United Phorphorus","GAL","OZ",71.680000000000007,{"$f":"179/2.5","v":71.599999999999994},71.64,"thiophanate-methyl"]
[173.1,"FUNGICIDE","Topsin 70% WSB","United Phorphorus","LB","OZ",8.4,8.6999999999999993,8.5500000000000007,"thiophanate-methyl"]
[173.3,"FUNGICIDE","Incognito","MANA Crop Protection","LB","LB",12.22,12.54,12.38,"thiophanate-methyl"]
[173.5,"FUNGICIDE","TwinLine","BASF","GAL","oz",226,236.4,231.2,"pyraclostrobin + metconazole"]
[174,"FUNGICIDE","Ultra Flourish","Nufarm Americas","GAL","PT",160,null,160,"metalaxyl"]
[174.5,"FUNGICIDE","Uppercut 3.6F ","Dupont","GAL","OZ",298.24,280.32,289.27999999999997,"tebuconazole"]
[175,"FUNGICIDE","Ziram","UPI","LB","LB",3.53,null,3.53,"ziram"]
[176,"FUNGICIDE","Zoxium","Dow AgroSciences","GAL","OZ",null,null,0,"zoxamide"]
[398]
[399,"GROWTH REG","Amplify","Loveland Products","OZ","OZ",null,null,{"$f":"ROUND(IF(G172=0,H172,IF(H172=0,G172,AVERAGE(G172,H172))),2)","v":0},"2, 6-Diisopropylnaphthalene"]
[400,"GROWTH REG","Cerone","Bayer Crop Science","GAL","PT",82.4,103.2,92.8,"ethephon"]
[401,"GROWTH REG","CottonQuik","Nufarm Ag Products","GAL","QT",38.72,42,40.36,"ethephon+AMADS"]
[402,"GROWTH REG","Def 6","Bayer Crop Science","GAL","PT",52.64,58.72,55.68,"S,S,S-Tributyle phosphorotrithioate"]
[403,"GROWTH REG","Dropp 50W","Bayer Crop Science","GAL","PT",40,45.45,42.73,"thidiazuron"]
[404,"GROWTH REG","Finish 6SC","Bayer Crop Science","GAL","PT",68.59,60.88,64.739999999999995,"ethephon+cyclanilide"]
[406,"GROWTH REG","ethephon 6","Various","GAL","PT",22,{"$f":"2.88*8","v":23.04},22.52,"ethephon"]
[407,"GROWTH REG","Super Boll",null,"GAL","PT",40.32,{"$f":"0.19*128","v":24.32},32.32,"ethephon+cyclanilide"]
[408,"GROWTH REG","Prep 6","Bayer Crop Science","GAL","PT",null,null,0,"ethephon"]
[409,"GROWTH REG","Pix Plus",null,"GAL","OZ",35.840000000000003,35.840000000000003,35.840000000000003,"mepiquat chloride"]
[410,"GROWTH REG","Gramoxone/Starfire","Various","GAL","PT",null,null,0,"paraquat"]
[411,"GROWTH REG","Prime Plus","Syngenta","GAL","QT",49,52,50.5,"flumetralin"]
[412,"GROWTH REG","Royal MH30","Chemtura","GAL","GAL",14.5,null,14.5,"maleic hydrazide"]
[413,"GROWTH REG","Sprout Nip","Loveland Products",null,null,null,null,0,"chlorpropham"]
[414,"GROWTH REG","Pentia","BASF","GAL","OZ",61.84,{"$f":"6.46*8","v":51.68},56.76,"mepiquat pentaborate"]
[415,"GROWTH REG","ProGibb 4% PGR","Valent","QT","OZ",15,null,15,"Gibberellic Acid"]
[500,"HERBICIDES"]
[501,"HERBICIDE","2, 4-D Amine","Various","GAL","PT",14.56,18,{"$f":"ROUND(IF(G189=0,H189,IF(H189=0,G189,AVERAGE(G189,H189))),2)","v":16.28},"2,4-D"]
[502,"HERBICIDE","2, 4-D Ester","Various","GAL","PT",17.600000000000001,21.35,19.48,"2,4-D"]
[503,"HERBICIDE","2, 4-DB","Various","GAL","PT",28,33.86,30.93,"2, 4-DB"]
[504,"HERBICIDE","Accent","DuPont","OZ","OZ",31.94,32.47,32.21,"nicosulfuron"]
[504.5,"HERBICIDE","Accent Q","DuPont","OZ","OZ",21.51,26.31,23.91,"nicosulfuron + safener"]
[505,"HERBICIDE","Aim EC","FMC","oz","OZ",{"$f":"136.17/32","v":4.2553124999999996},5.65,4.95,"carfentrazone-ethyl"]
[506,"HERBICIDE","Alanap-L","Crompton Uniroyal","GAL","GAL",37.5,38.53,38.020000000000003,"naptalam"]
[507,"HERBICIDE","Ally XP (Purestand)","DuPont","OZ","OZ",2.95,3.15,3.05,"metsulfuron-methyl"]
[508,"HERBICIDE","Arrow","MANA Crop Protection","GAL","QT",74.19,89.03,81.61,"clethodim"]
[508.5,"HERBICIDE","Arsenal",null,"GAL","QT",280,320,300,"imazapyr"]
[509,"HERBICIDE","Assure II *","DuPont","GAL","OZ",90.96,94.72,92.84,"quizalofop-p-ethyl"]
[510,"HERBICIDE","Atrazine 4L","Various","GAL","QT",14.25,16.239999999999998,15.25,"atrazine"]
[511,"HERBICIDE","Authority XL","FMC","LB","OZ",42.9,46,44.45,"sulfentrazone"]
[511.1,"HERBICIDE","Authority Assist 4L","FMC","GAL","PT",287.05,300,293.52999999999997,"Authority + Pursuit"]
[511.2,"HERBICIDE","Authority First DF","FMC","LB","OZ",61.65,64.81,63.23,"Authority + metribuzin"]
[511.5,"HERBICIDE","Axial XL","Syngenta","GAL","OZ",115.69,149.76,132.72999999999999,"penoxaden"]
[512,"HERBICIDE","Balan 60DF","Loveland Products","LB","LB",11.25,null,11.25,"benefin"]
[513,"HERBICIDE","Balance Pro","Bayer Crop Science","OZ","OZ",5.8,6.96,6.38,"isoxaflutole"]
[513.5,"HERBICIDE","Balance Flexx","Bayer Crop Science","GAL","OZ",357.12,485.98,421.55,"isoxaflutole 2#ai/gal"]
[514,"HERBICIDE","Banvel","MicroFlo","GAL","PT",78.319999999999993,107.44,92.88,"dicamba"]
[515,"HERBICIDE","Basagran","MicroFlo","GAL","QT",105.84,98.48,102.16,"bentazon"]
[516,"HERBICIDE","Beacon","Syngenta","OZ","OZ",31.45,34.869999999999997,33.159999999999997,"primisulfuron"]
[516.79999999999995,"HERBICIDE","Blazer (Ultra)","United Phorphorus","GAL","PT",{"$f":"8.56*8","v":68.48},{"$f":"9.4*8","v":75.2},71.84,"acifluorfen"]
[516.9,"HERBICIDE","Breakfree","Dupont ","GAL","PT",31,37.200000000000003,34.1,"acetochlor"]
[517,"HERBICIDE","Buctril 4EC","Bayer Crop Science","GAL","PT",{"$f":"16.4*8","v":131.19999999999999},{"$f":"17.06*8","v":136.47999999999999},133.84,"bromoxynil"]
[517.5,"HERBICIDE","Cadet","FMC","QT","OZ",305,340,322.5,"fluthiacet-methyl"]
[518,"HERBICIDE","Cadre","BASF","GAL","OZ",{"$f":"4.2*128","v":537.6},{"$f":"3.54*128","v":453.12},495.36,"imazapic"]
[519,"HERBICIDE","Callisto","Syngenta","GAL","OZ",{"$f":"4.63*128","v":592.64},613.41,603.03,"mesotrione"]
[519.5,"HERBICIDE","Caparol 4L","Syngenta","GAL","PT",26.88,36.799999999999997,31.84,"prometryn"]
[520,"HERBICIDE","Chateau","Valent Chemical","LB","OZ",81.73,87.87,84.8,"flumioxazin"]
[520.5,"HERBICIDE","Cinch","DuPont","GAL","PT",79.86,95.83,87.85,"s-metolachlor"]
[520.6,"HERBICIDE","Cinch ATZ","DuPont","GAL","PT",42,45,43.5,"s-metolachlor +atrazine"]
[521,"HERBICIDE","Classic","DuPont","OZ","OZ",15.2,17.18,16.190000000000001,"chlorimuron ethyl 25%"]
[521.5,"HERBICIDE","Curio","Nufarm Ag Products","OZ","OZ",8.4499999999999993,9.5,8.98,"chlorimuron ethyl 25%"]
[522,"HERBICIDE","Clarity","BASF","GAL","PT",{"$f":"11.55*8","v":92.4},94.88,93.64,"dicamba"]
[523,"HERBICIDE","Cobra","Valent","GAL","OZ",{"$f":"1.47*128","v":188.16},{"$f":"1.72*128","v":220.16},204.16,"lactofen"]
[524,"HERBICIDE","Command 3ME","FMC","GAL","PT",125.41,{"$f":"19.93*8","v":159.44},142.43,"clomazone"]
[525,"HERBICIDE","Curbit ","CPS","GAL","PT",38.270000000000003,null,38.270000000000003,"ethalfluralin"]
[526,"HERBICIDE","Dacthal 6F","Amvac Chemical","GAL","PT",149.56,150,149.78,"DCPA"]
[526.5,"HERBICIDE","Dacthal 75W *","Amvac Chemical","LB","LB",22.1,21.92,22.01,"DCPA"]
[527,"HERBICIDE","Define","Bayer Crop Science","LB","OZ",null,22,22,"flufenacet"]
[528,"HERBICIDE","Degree 3.8ME","Monsanto","GAL","PT",31,37.200000000000003,34.1,"acetochlor"]
[530,"HERBICIDE","Devrinol 10G","UPI","lB","LB",2.42,null,2.42,"napropamide"]
[530.20000000000005,"HERBICIDE","Devrinol 2-C350XT","UPI","GAL","PT",44.5,45.5,45,"napropamide"]
[530.5,"HERBICIDE","Devrinol 50DF","UPI","LB","LB",10.5,12,11.25,"napropamide"]
[531,"HERBICIDE","Distinct/Overdrive","BASF","LB","OZ",36.630000000000003,43.96,40.299999999999997,"dicamba"]
[531.5,"HERBICIDE","Reglone","Syngenta","GAL","PT",93.73,115,104.37,"diquat"]
[532,"HERBICIDE","Parallel","MANA Crop Protection","GAL","PT",116.74,{"$f":"14.83*8","v":118.64},117.69,"s-metolachlor"]
[532.5,"HERBICIDE","Envoke","Syngenta","OZ","OZ",88.53,102.89,95.71,"Trifloxysulfuron-sodium"]
[533,"HERBICIDE","Eptam 7E","Gowan Company","GAL","PT",28,43,35.5,"EPTC"]
[533.5,"HERBICIDE","Eradicane","Syngenta","GAL","PT",26.45,null,26.45,"EPTC"]
[534,"HERBICIDE","Evik DF","Syngenta","LB","LB",8.66,10.11,9.39,"ametryn"]
[535,"HERBICIDE","Express","DuPont","OZ","OZ",16.34,19.61,17.98,"tribenuron"]
[536,"HERBICIDE","First Rate","Dow AgroSciences","OZ","OZ",30.35,32.340000000000003,31.35,"chloransulam methyl"]
[537,"HERBICIDE","Flexstar","Syngenta","GAL","PT",{"$f":"8.41*8","v":67.28},null,67.28,"fomesafen ? lbs/gal"]
[538,"HERBICIDE","Fusilade DX","Syngenta","GAL","PT",{"$f":"1.03*128","v":131.84},{"$f":"1.23*128","v":157.44},144.63999999999999,"fluazifop-P"]
[538.5,"HERBICIDE","Galigan","MANA Crop Protection","GAL","PT",82.48,80.849999999999994,81.67,"oxyfluorfen"]
[539,"HERBICIDE","Glean","DuPont","OZ","OZ",17.34,20.81,19.079999999999998,"chlorsulfuron"]
[540,"HERBICIDE","Goal 2XL","Dow AgroSciences","GAL","QT",59,67.66,63.33,"oxyfluorfen"]
[541,"HERBICIDE","Gramoxone SL","Syngenta","GAL","PT",25.6,19.2,22.4,"paraquat"]
[541.6,"HERBICIDE","Gramoxone Max","Syngenta","GAL","PT",{"$f":"5.46*8","v":43.68},45.75,44.72,"paraquat"]
[541.79999999999995,"HERBICIDE","Gramoxone products","Various","GAL","PT",20.010000000000002,22.73,21.37,"paraquat"]
[542,"HERBICIDE","Harmony SG","DuPont","OZ","OZ",30.63,null,30.63,"thifensulfuron-methyl"]
[543,"HERBICIDE","Harness Xtra 5.6L","Monsanto","GAL","PT",31.9,42.45,37.18,"acetochlor + atrazine"]
[544,"HERBICIDE",null,null,null,null,null,null,{"$f":"ROUND(IF(G253=0,H253,IF(H253=0,G253,AVERAGE(G253,H253))),2)","v":0}]
[544.20000000000005,"HERBICIDE","Ignite 280","Bayer Crop Science","GAL","OZ",{"$f":"6.57*8","v":52.56},47.85,50.21,"glufosinate-ammonium"]
[544.5,"HERBICIDE","Impact","Amvac Chemical","OZ","OZ",15.95,16.25,16.100000000000001,"topramezone"]
[544.70000000000005,"HERBICIDE","Intrro","Monsanto","GAL","QT",28.19,27.1,27.65,"alachlor"]
[545,"HERBICIDE","Karmex","Griffin","LB","LB",6.99,7.11,7.05,"diuron"]
[546,"HERBICIDE","Kerb","Dow AgroSciences","LB","LB",40.67,38.979999999999997,39.83,"pronamide"]
[547,"HERBICIDE","Lasso","Monsanto","GAL","QT",{"$f":"6.6*4","v":26.4},null,26.4,"alachlor"]
[547.5,"HERBICIDE","Laudis","Bayer Crop Science","GAL","OZ",563.99,574.99,569.49,"tembotrione"]
[548,"HERBICIDE","Liberty 280 SL","BAYER Crop Science","GAL","PT",{"$f":"128*0.6","v":76.8},75,75.900000000000006,"glufosinate-ammonium"]
[549,"HERBICIDE","Linex","Griffin","GAL","PT",{"$f":"9.28*8","v":74.239999999999995},72.239999999999995,73.239999999999995,"linuron"]
[549.5,"HERBICIDE","Lorox DF","Griffin","LB","OZ",24.12,20.059999999999999,22.09,"linuron"]
[549.79999999999995,"HERBICIDE","Lontrel","Dow AgroSciences","QT","PT",169,null,169,"clopyralid"]
[550,"HERBICIDE","Matrix","DuPont","OZ","OZ",14.08,null,14.08,"rimsulfuron"]
[551,"HERBICIDE","Maverick","Monsanto","OZ","OZ",14.63,17.559999999999999,16.100000000000001,"sulfosulfuron"]
[551.5,"HERBICIDE","MCPA","Various",null,null,null,null,0,"MCPA"]
[552,"HERBICIDE","MSMA","Various","GAL","QT",{"$f":"2.9*8","v":23.2},23.44,23.32,"MSMA"]
[552.5,"HERBICIDE","Metsulfuron Methyl Ag","Arysta Life Science","OZ","OZ",null,8.1300000000000008,8.1300000000000008,"metsulfuron mythyl"]
[553,"HERBICIDE","Micro-Tech","Monsanto","GAL","PT",28,33,30.5,"alachlor"]
[553.5,"HERBICIDE","Milestone","Dow AgroSciences","GAL","OZ",{"$f":"95.16*4","v":380.64},390,385.32,"aminopyralid"]
[554,"HERBICIDE","Option","Bayer Crop Science","OZ","OZ",9.92,10.31,10.119999999999999,"foramsulfuron"]
[554.5,"HERBICIDE","Osprey","Bayer Crop Science","OZ","OZ",2.75,3.61,3.18,"mesosulfuron-methyl"]
[555,"HERBICIDE","Outlook","BASF","GAL","OZ",{"$f":"17.47*8","v":139.76},167.52,153.63999999999999,"dimethenamid-P"]
[555.5,"HERBICIDE","Paramount","BASF","LB","OZ",56,63,59.5,"quinclorac"]
[556,"HERBICIDE","Peak","Syngenta","OZ","OZ",14,null,14,"prosulfuron"]
[557,"HERBICIDE","Pendimax","Dow AgroSciences","GAL","PT",{"$f":"2.47*8","v":19.760000000000002},24.64,22.2,"pendimethalin"]
[558,"HERBICIDE","Permit 75DF","Gowan","OZ","OZ",22.43,24,23.22,"halosulfuron"]
[558.5,"HERBICIDE","Plateau",null,"OZ","OZ",13.75,13.89,13.82,"imazapic"]
[559,"HERBICIDE","Poast","BASF","GAL","PT",87.15,{"$f":"12.77*8","v":102.16},94.66,"sethoxydim"]
[559.5,"HERBICIDE","Poast Plus","MicroFlo","GAL","PT",{"$f":"8.42*8","v":67.36},60.93,64.150000000000006,"sethoxydim (+ surfactant)"]
[560,"HERBICIDE","PowerFlex","Dow AgroSciences","LB","OZ",42.46,44.47,43.47,"pyroxsulam"]
[561,"HERBICIDE","Prefar","Gowan Company","GAL","QT",55,58,56.5,"bensulide"]
[562,"HERBICIDE","Princep 4L","Syngenta","GAL","QT",{"$f":"2.54*8","v":20.32},19,19.66,"simazine","g."]
[563,"HERBICIDE","Prowl 3.3EC","BASF","GAL","PT",33,39,36,"pendimethalin"]
[563.5,"HERBICIDE","Prowl H2O","BASF","GAL","PT",31.52,38,34.76,"pendimethalin"]
[564,"HERBICIDE","Pursuit DG","BASF","OZ","OZ",{"$f":"377.06/128","v":2.94578125},3.51,3.23,"imazethapyr"]
[565,"HERBICIDE","Python WDG","Dow AgroSciences","LB","OZ",199.68,{"$f":"13.2*16","v":211.2},205.44,"flumetsulam"]
[566,"HERBICIDE","Raptor","BASF","GAL","OZ",{"$f":"4.38*128","v":560.64},591.36,576,"imazamox"]
[567,"HERBICIDE","Reflex 2LC","Syngenta","GAL","PT",49,{"$f":"6.52*8","v":52.16},50.58,"fomesafen"]
[568,"HERBICIDE","Remedy Ultra","Dow AgroSciences","GAL","QT",{"$f":"9.6*8","v":76.8},null,76.8,"trilopyr"]
[568.5,"HERBICIDE","Resolve","DuPont","OZ","OZ",7.7,6.62,7.16,"rimsulfuron"]
[568.6,"HERBICIDE","Rule","MANA Crop Protection","OZ","OZ",7.7,9,8.35,"rimsulfuron"]
[569,"HERBICIDE","Resource","Valent","GAL","OZ",{"$f":"8*27.28","v":218.24},194.67,206.46,"flumiclorac-methyl"]
[569.5,"HERBICIDE","Ro-Neet",null,null,null,{"$f":"420/2.5","v":168},null,168]
[570,"HERBICIDE","Roundup or other formulations","Various","GAL","QT",15.5,16.89,16.2,"glyphosate"]
[570.5,"HERBICIDE","Roundup W-Max","Monsanto","GAL","QT",30.72,{"$f":"4.46*8","v":35.68},33.200000000000003,"glyphosate"]
[570.79999999999995,"HERBICIDE","Roundup Power-Max","Monsanto","GAL","QT",23.95,24.23,24.09,"glyphosate"]
[571,"HERBICIDE","Rodeo","Dow AgroSciences","GAL","PT",31.28,44.48,37.880000000000003,"glyphasate"]
[572,"HERBICIDE","Sandea","Gowan Company","OZ","OZ",37,40.85,38.93,"halosulfuron"]
[572.5,"HERBICIDE","Sedgehammer","Monsanto","OZ","OZ",37.4,34.049999999999997,35.729999999999997,"halosulfuron"]
[573,"HERBICIDE","Scepter","BASF","OZ","OZ",4.33,3.96,4.1500000000000004,"imazaquin"]
[574,"HERBICIDE","Select 2EC","Various","GAL","OZ",42.5,47.5,45,"clethodim  2#/Gal"]
[574.5,"HERBICIDE","Select Max w/IT","Valent","GAL","OZ",81,null,81,"clethodim  .97#/Gal"]
[575,"HERBICIDE","Sencor","Bayer/Aventis","LB","LB",15.87,null,15.87,"metribuzin 75","g."]
[576,"HERBICIDE","Asulox XP","United Phorphorus","GAL","PT",51.6,null,51.6,"asulam"]
[577,"HERBICIDE","Sinbar WDG","TKI","LB","LB",43,44.52,43.76,"terbacil"]
[578,"HERBICIDE","Sharpen","Kixor (BASF)","GAL","OZ",666.15,null,666.15,"saflufenacil"]
[579,"HERBICIDE","Sonalon","Dow AgroSciences","GAL","PT",29.26,35.11,32.19,"ethalfluralin"]
[579.5,"HERBICIDE","Spartan 4F","FMC","GAL","OZ",490,500,495,"sulfentrazone"]
[580,"HERBICIDE","Spartan Charge","FMC","GAL","OZ",415,{"$f":"3.2*128","v":409.6},412.3,"sulfentrazone"]
[581,"HERBICIDE","Spike 20P","Dow AgroSciences","LB","LB",8.8000000000000007,10.199999999999999,9.5,"tebuthiron"]
[581.5,"HERBICIDE","Starane Ultra","Dow AgroSciences",null,null,null,null,0,"fluroxypyr"]
[582,"HERBICIDE","Telar","Dupont","OZ","OZ",{"$f":"365/16","v":22.8125},{"$f":"23.44*8","v":187.52},105.17,"chlorsulfuron"]
[582.5,"HERBICIDE","Skirmish","FMC",null,null,null,null,0,"chlorimuron ethyl"]
[582.79999999999995,"HERBICIDE","Spin-aid",null,null,null,null,null,0]
[583,"HERBICIDE","Staple","DuPont","OZ","OZ",16.010000000000002,16.91,{"$f":"ROUND(IF(G317=0,H317,IF(H317=0,G317,AVERAGE(G317,H317))),2)","v":16.46},"Pyrithiobac sodium"]
[583.1,"HERBICIDE","Staple LX","DuPont","OZ","OZ",7.63,7.91,7.77,"Pyrithiobac sodium"]
[584,"HERBICIDE","Stinger","Dow AgroSciences","GAL","PT",315.89999999999998,346,330.95,"flumetsulam"]
[585,"HERBICIDE","Strongarm","Dow AgroSciences","OZ","OZ",46.04,47.07,46.56,"diclosulam"]
[586,"HERBICIDE","Surflan A.S.",null,"GAL","QT",41,43.84,42.42,"oryzalin"]
[587,"HERBICIDE","Tillam","Monterey Chemical",null,null,null,null,0,"pebulate"]
[588,"HERBICIDE","Topnotch","Dow AgroSciences","GAL","QT",27.87,33.44,30.66,"acetochlor"]
[589,"HERBICIDE","Touchdown Total","Syngenta","GAL","QT",20.64,24,22.32,"glyphosate"]
[590,"HERBICIDE","Treflan / Trilin / Triflurex","Various","GAL","PT",{"$f":"3.52*8","v":28.16},24.2,26.18,"trifluralin"]
[591,"HERBICIDE","Cotoran, Meturon","MANA Crop Protection","GAL","PT",42,{"$f":"6.12*8","v":48.96},45.48,"fluometuron"]
[592,"HERBICIDE","Ultra Blazer",null,"GAL","PT",82.48,77,79.739999999999995,"acifluorfen"]
[593,"HERBICIDE","Valor SX","Valent","LB","OZ",{"$f":"4.57*16","v":73.12},79.55,76.34,"flumioxazin"]
[594,"HERBICIDE","Velpar L","DuPont","GAL","PT",67.95,81.540000000000006,74.75,"hexazinone"]
[596,"HERBICIDE","Vinegar","Various","GAL","GAL",2,null,2,"acetic acid"]
[597,"HERBICIDE","Zorial 80DF","Syngenta","LB","LB",13.95,14.95,14.45,"Norflurazon"]
[597.5,"HERBICIDE","Anthem","FMC","GAL","OZ",null,360,360,"Pyroxsulfone + Fluthiacet-mythl"]
[598,"HERBICIDE","Axiom 68DF","Bayer Crop Science","LB","LB",{"$f":"1.92*16","v":30.72},29.81,30.27,"FOE-5043 + Metribuzine"]
[599,"HERBICIDE","Backdraft 1.5 EC",null,"GAL","QT",18.72,19.2,18.96,"Scepter + Glyphosate"]
[600,"HERBICIDE","Basis DF","DuPont*","OZ","OZ",15.38,15.55,15.47,"rimsulfuron + thifensulfuron"]
[601,"HERBICIDE","Basis Blend","DuPont*","LB","OZ",6.9,null,6.9,"Atrazine + Accent + Matrix"]
[602,"HERBICIDE","BICEP Lite II Magnum 6L","Syngenta","GAL","QT",{"$f":"11.82*4","v":47.28},57.27,52.28,"Dual+atrazine"]
[602.5,"HERBICIDE","BICEP II Magnum 5.5L","Syngenta","GAL","QT",33.5,35.82,34.659999999999997,"Dual+atrazine"]
[603,"HERBICIDE","Boundary 6.5 EC","Syngenta","GAL","PT",{"$f":"9.67*8","v":77.36},76.88,77.12,"Dual II Magnum + Metribuzine"]
[603.20000000000005,"HERBICIDE","Buccaneer Plus","Tenkoz, Inc","GAL","PT",16,19.690000000000001,17.850000000000001,"glyphozate"]
[603.5,"HERBICIDE","Buctril + atrazine","Bayer Crop Science",null,null,null,{"$f":"49.22/2.5","v":19.687999999999999},19.690000000000001,"Buctril + atrazine"]
[604,"HERBICIDE","Bullet ","Monsanto","GAL","QT",{"$f":"2.97*8","v":23.76},27,25.38,"Lasso MT + atrazine"]
[605,"HERBICIDE","Camix","Syngenta","LB","OZ",61,66,63.5,"Dual II Magnum + Callisto"]
[605.5,"HERBICIDE","Capreno","Bayer Crop Science","GAL","OZ",625,{"$f":"7.13*128","v":912.64},768.82,"Laudis + thiencarbazone +safener"]
[606,"HERBICIDE","Canopy EX WDG","DuPont","OZ","OZ",2.88,3.05,2.97,"chlorimuron + tribenuron"]
[606.5,"HERBICIDE","Canopy 75DF","DuPont","LB","OZ",{"$f":"2.21*16","v":35.36},47.68,41.52,"chlorimuron + metribuzin"]
[607,"HERBICIDE","Celebrity Plus 70DF","BASF","LB","OZ",84.5,95,89.75,"Distinct + Accent"]
[608,"HERBICIDE","Cimarron Max","DuPont","GAL","PT",null,null,0,"metsulfuron-methyl+dicamba+2,4-D"]
[608.1,"HERBICIDE","Cimarron Plus","DuPont","OZ","OZ",13.1,11.65,12.38,"metsulfuron-methyl + chlorsulfuron"]
[609,"HERBICIDE","Chaparral","Dow AgroSciences",null,null,null,null,0,"Milestone + Cimarron"]
[610,"HERBICIDE","Curtail2","Dow AgroSciences","GAL","PT",42,46,44,"Stinger + 2,4-D amine"]
[611,"HERBICIDE","Crossbow","Helena","GAL","QT",49.5,49.9,49.7,"2,4-D + triclopyr"]
[612,"HERBICIDE","Degree Xtra 4EC","Monsanto","GAL","PT",22.1,26.52,24.31,"Harness + atrazine"]
[613,"HERBICIDE","Clearmax, Raptor","BASF","GAL","OZ",null,null,null,"imazamox"]
[614,"HERBICIDE"]
[615,"HERBICIDE","Enlist Duo","Dow AgroSciences",null,null,null,null,{"$f":"ROUND(IF(G356=0,H356,IF(H356=0,G356,AVERAGE(G356,H356))),2)","v":0}]
[615.5,"HERBICIDE","Equip 32G",null,"OZ","OZ",10.65,12,11.33,"foramsulfuron + iodosulfuron"]
[616,"HERBICIDE","Exceed 57WG","Syngenta","OZ","OZ",10.71,11.77,11.24,"Peak + Beacon"]
[616.5,"HERBICIDE","Expert 4.88EC","Syngenta","GAL","PT",{"$f":"4.19*8","v":33.520000000000003},{"$f":"4.39*8","v":35.119999999999997},34.32,"Dual II Magnum + Roundup + Atrazine"]
[617,"HERBICIDE","Extreme 2.17EC","BASF","GAL","PT",22.82,null,22.82,"Pursuit + glyphosate"]
[617.5,"HERBICIDE","Fieldmaster 4.25SE","Monsanto","GAL","PT",25.02,30.02,27.52,"Roundup+Harness+Atrazine"]
[617.79999999999995,"HERBICIDE","Finesse 75DF","DuPont","OZ","OZ",16.059999999999999,16.54,16.3,"Glean + Ally"]
[618,"HERBICIDE","Flexstar GT 3L","Syngenta","GAL","PT",30.17,{"$f":"8.41*8","v":67.28},48.73,"fomesafen + glyphosate"]
[619,"HERBICIDE","Forefront HL","Dow AgroSciences","GAL","PT",63,null,63,"Milestone + 2,4-D"]
[619.5,"HERBICIDE","Freedom","Monsanto","GAL","QT",{"$f":"2.51*4","v":10.039999999999999},null,10.039999999999999,"Lasso + Trifluralin"]
[620,"HERBICIDE","Fultime 4EC","Dow AgroSciences","GAL","QT",{"$f":"5.21*8","v":41.68},37,39.340000000000003,"Topnotch + atrazine"]
[621,"HERBICIDE","Fusion 2.56EC","Syngenta","GAL","PT",{"$f":"26.64*8","v":213.12},203.69,208.41,"Fusilade 2000 + Bugle"]
[622,"HERBICIDE","Garlon 4","Dow AgroSciences","GAL","PT",73,90,81.5,"triclopyr"]
[622.5,"HERBICIDE","Gangster (copack)","Valent",null,null,null,null,0,"Valor + Firstrate"]
[623,"HERBICIDE","Grazon P+D","Dow AgroSciences","GAL","PT",32,null,32,"2,4-D + Tordon"]
[624,"HERBICIDE","Guardsman Max 5L","BASF","GAL","PT",{"$f":"6.92*8","v":55.36},45.7,50.53,"Atrazine + Outlook"]
[625,"HERBICIDE","Harmony Extra SG","DuPont","OZ","OZ",12.68,13.79,13.24,"Harmony SG + Express"]
[626,"HERBICIDE","Harness Extra 50SG","Syngenta","GAL","OZ",63.96,{"$f":"9.45*8","v":75.599999999999994},69.78,"Harness + atrazine"]
[627,"HERBICIDE","Hornet WDG","Dow AgroSciences","LB","OZ",58.62,57.32,57.97,"Broadstrike + Stinger"]
[627.5,"HERBICIDE","Intregrity","Kixor (BASF)",null,"OZ",null,null,0,"Sharpen + Outlook"]
[628,"HERBICIDE","Keystone","Dow AgroSciences","GAL","QT",26.97,32.36,29.67,"acetochlor + atrazine"]
[629,"HERBICIDE","Laddok S12 5L","MicroFlo","GAL","PT",49,55,52,"basagran + atrazine"]
[630,"HERBICIDE","Landmaster 3.1SL","Monsanto","GAL","OZ",16,22,19,"glyphosate + 2,4-D amine"]
[631,"HERBICIDE","Lariat 4L","Monsanto","GAL","QT",{"$f":"7.29*4","v":29.16},25,27.08,"Lasso EC + atrazine"]
[631.5,"HERBICIDE","Lexar EZ","Syngenta","GAL","QT",null,{"$f":"7.96*8","v":63.68},63.68,"atrazine + Dual II Maginum + Callisto"]
[632,"HERBICIDE",null,null,null,null,null,null,0]
[633,"HERBICIDE","Lightning 70DG","BASF","OZ","OZ",14.25,14.62,14.44,"Pursuit + Arsenal"]
[634,"HERBICIDE","Lumax EZ","Syngenta","GAL","QT",52,55,53.5,"atrazine + Dual II Maginum + Callisto"]
[635,"HERBICIDE","Marksman 3.2L","BASF","GAL","PT",34,37,35.5,"Banvel/Clarity + atrazine"]
[635.5,"HERBICIDE","NorthstarCustom Pak","Syngenta","OZ","OZ",1.44,null,1.44,"Beacon + Banvel/Clarity"]
[636,"HERBICIDE","Parallel Plus","MANA Crop Protection","GAL","QT",40.619999999999997,{"$f":"10.57*4","v":42.28},41.45,"metolachlor+atrazine+safener"]
[636.5,"HERBICIDE","PasturGard 2.5L","Dow AgroSciences","GAL","PT",57.37,{"$f":"131.76/2.5","v":52.703999999999994},55.04,"Remedy + Vista"]
[637,"HERBICIDE","Prefix 5.29 EC","Syngenta","GAL","PT",47.15,39.85,43.5,"Dual II Magnum + Reflex"]
[637.5,"HERBICIDE","Pursuit Plus EC","BASF","GAL","PT",{"$f":"7.1*8","v":56.8},63,59.9,"Pursuit + Prowl"]
[638,"HERBICIDE","Radius 4L","Bayer Crop Science","GAL","PT",null,null,0,"Define + Balance"]
[638.5,"HERBICIDE","Rage D-Tech 6EC","FMC","GAL","PT",null,null,0,"Aim + 2,4-D ester"]
[639,"HERBICIDE","Readymaster ATZ 4L","Monsanto","GAL","PT",null,null,0,"glyphosate + atrazine"]
[639.5,"HERBICIDE","Redeem 3EC","Dow AgroSciences","GAL","PT",112,140,126,"Stinger + Clopyralid"]
[639.6,"HERBICIDE","Require Q","DuPont",null,"OZ",7.52,null,7.52,"Resolve + dicamba + safener"]
[639.70000000000005,"HERBICIDE","Resolve Q 22.4DF","DuPont","OZ","OZ",6.62,null,6.62,"Matrix + Harmony SG"]
[640,"HERBICIDE","Sequence","Syngenta","GAL","PT",{"$f":"5.95*8","v":47.6},47.28,47.44,"glyphosate + Dual II Magnum"]
[640.5,"HERBICIDE","Sonic/Authority First 70DF","Dow AgroSciences","OZ","OZ",null,null,0,"Authority + FirstRate"]
[641,"HERBICIDE","Spirit 57WDG","Syngenta","OZ","OZ",11.75,null,11.75,"Beacon + Peak"]
[642,"HERBICIDE","Status 56WG","BASF","OZ","OZ",3.45,null,3.45,"Banvel/Clarity + diflufenzopyr"]
[643,"HERBICIDE","Steadfast ATZ","DuPont","OZ","OZ",17.8,21.36,19.579999999999998,"Accent + Matrix + atrazine"]
[643.5,"HERBICIDE","Steadfast 75DF","DuPont","OZ","OZ",23.95,24.68,24.32,"Accent + Matrix"]
[643.6,"HERBICIDE","Steadfast Q","DuPont","OZ","OZ",10.39,12.26,11.33,"Accent + Matrix + safener"]
[645,"HERBICIDE","Strategy","Loveland Products","GAL","PT",42,43,42.5,"Command + Curbit"]
[645.5,"HERBICIDE","Surestart","Dow AgroSciences","GAL","PT",null,null,0,"Topnotch + Python + Stinger + safener"]
[646,"HERBICIDE","Spartan Charge","FMC","GAL","OZ",360,385,372.5,"sulfentrazone + carfentrazone"]
[647,"HERBICIDE","Storm 4S","UPA","GAL","PT",{"$f":"11.41*8","v":91.28},89.44,90.36,"Basagran + Blazer"]
[648,"HERBICIDE","Stout 72.5DF","DuPont","OZ","OZ",18.239999999999998,20,19.12,"Accent + Harmony SG"]
[648.5,"HERBICIDE","Surmount 1.34SL","Dow AgroSciences","GAL","PT",null,null,0,"Vista + Tordon"]
[649,"HERBICIDE","Synchrony XP STS","DuPont","OZ","OZ",11.12,null,11.12,"Classic + Pinnacle"]
[650,"HERBICIDE","TNT Broadleaf 75DF","Gowan Company","OZ","OZ",null,null,0,"Harmony SG + Express"]
[650.5,"HERBICIDE","T-Square","Dupont","OZ","OZ",6.5,8.4,7.45,"Harmony SG + Express"]
[651,"HERBICIDE","Valor XLT 50WDG","Valent","LB","OZ",71,null,71,"Valor + Classic"]
[652,"HERBICIDE","Weed Master 3.87L","Nufarm","GAL","PT",null,null,0,"Banvel + 2,4-D Amine"]
[675,"HERBICIDE","Yukon 67.5WDG","Monsanto","OZ","OZ",3.4,null,3.4,"Permit + Banvel"]
[700,"ADJUVANTS"]
[701,"ADJUVANTS","Foam Marker",null,"GAL","PT",16.5,null,{"$f":"ROUND(IF(G416=0,H416,IF(H416=0,G416,AVERAGE(G416,H416))),2)","v":16.5}]
[702,"ADJUVANTS","MSO",null,"GAL","PT",9.6,null,9.6]
[703,"ADJUVANTS","MSO Silicon Enhanced",null,"GAL","PT",28.5,null,28.5]
[704,"ADJUVANTS","Cohere","Helena","GAL","PT",51.67,52.8,52.24]
[705,"ADJUVANTS","Crop Oil Concentrate","Various","GAL","PT",9.4,12.05,10.73]
[705.5,"ADJUVANTS","Crop Oil Conc - Veg","Various","GAL","PT",16.64,14.63,15.64]
[706,"ADJUVANTS","Drift Control","Agrisolutions","GAL","PT",46.88,{"$f":"5.86*8","v":46.88},46.88]
[707,"ADJUVANTS","Foambuster Max","Helena","Qt","PT",26,28.44,27.22,16.5]
[708,"ADJUVANTS","Grounded","Helena","GAL","PT",25.03,25.33,25.18]
[709,"ADJUVANTS","Intac Plus","UAP Loveland","GAL","PT",null,null,0]
[710,"ADJUVANTS","Nu-film","Miller Chemical","GAL","PT",29.75,null,29.75]
[711,"ADJUVANTS","SoyOil",null,"GAL","PT",8.4,7.75,8.08]
[712,"ADJUVANTS","Induce","Helena","GAL","PT",28.72,31.53,30.13]
[713,"ADJUVANTS","Spectrum",null,"GAL","PT",21.86,null,21.86,"Compatiablity Agent"]
[714,"ADJUVANTS","Spreader Sticker","Various","GAL","PT",22.4,{"$f":"3.77*8","v":30.16},26.28]
[715,"ADJUVANTS","Nonionic Surfactant","Various","GAL","PT",9.2200000000000006,null,9.2200000000000006,"surfactant"]
[800,"INSECTICIDES"]
[800.5,"INSECTICIDE","Temik 15G","Bayer Crop Science","LB","LB",3.95,3.8,{"$f":"ROUND(IF(G433=0,H433,IF(H433=0,G433,AVERAGE(G433,H433))),2)","v":3.88},"aldicarb"]
[801.1,"INSECTICIDE","Acephate 90%","United Phorphorus","LB","LB",null,7.43,7.43,"acephate"]
[801.5,"INSECTICIDE","Acephate 97","United Phorphorus","LB","LB",7,8,7.5,"acephate"]
[802,"INSECTICIDE","Acramite 50 WS","Chemtura","LB","OZ",61,62.62,61.81,"bifenazate"]
[802.5,"INSECTICIDE","Actara","Syngenta","LB","OZ",3.05,3.15,3.1,"thiamethoxam"]
[802.8,"INSECTICIDE","Concur Seed Treatment",null,"OZ","OZ",null,null,0,"imidacloprid"]
[802.9,"INSECTICIDE","Latitude Seed Treatment",null,"OZ","OZ",null,null,0,"imidacloprid"]
[803,"INSECTICIDE","Alias 4F","MANA Crop Protection","GAL","OZ",72,102,87,"imidacloprid"]
[803.5,"INSECTICIDE","Admire Pro 4.6SC","Bayer Crop Science","OZ","OZ",1,1.7,1.35,"imidacloprid"]
[804,"INSECTICIDE","Agree","Certis USA","LB","LB",12.47,14.53,13.5,"bacillus thuringiensis aizawai + kurstaki"]
[805,"INSECTICIDE","Agrox D-L",null,"OZ","OZ",{"$f":"168.4/32","v":5.2625000000000002},null,5.26,"diazinon + lindane"]
[805.5,"INSECTICIDE","Agri-mek .15EC","Syngenta","GAL","OZ",157,203.11,180.06,"abamectin"]
[806,"INSECTICIDE","Ambush","Amvac Chemical","GAL","OZ",{"$f":"0.28*128","v":35.840000000000003},135,85.42,"permethrin"]
[807,"INSECTICIDE","Ammo 2.5EC","Helena","GAL","OZ",{"$f":"0.92*128","v":117.76},null,117.76,"cypermethrin"]
[808,"INSECTICIDE","Apollo SC","MANA Crop Protection","PT","OZ",77.739999999999995,81.7,79.72,"clofantezine"]
[809,"INSECTICIDE","Asana XL","DuPont","GAL","OZ",{"$f":"0.58*128","v":74.239999999999995},65,69.62,"esfenvalerate"]
[810,"INSECTICIDE","Assail 30SG","United Phorphorus","OZ","OZ",4.97,5.25,5.1100000000000003,"acetmiprid"]
[810.5,"INSECTICIDE","Assail 70WP","United Phorphorus","OZ","OZ",13,14.5,13.75,"acetmiprid"]
[811,"INSECTICIDE","Avaunt","DuPont","OZ","OZ",5.44,5.9,5.67,"indoxacarb"]
[812,"INSECTICIDE","Aza-direct, Azatin","Gowan Company","GAL","PT",209,235.73,222.37,"azadirachtin"]
[813,"INSECTICIDE","Aztec","Bayer Crop Science","LB","OZ",2.88,3.4,3.14,"azadirachtin"]
[814,"INSECTICIDE","Baythroid XL","Bayer Crop Science","GAL","OZ",null,{"$f":"2.65*128","v":339.2},339.2,"cyfluthrin"]
[814.2,"INSECTICIDE","Belt SC","Bayer Crop Science","OZ","OZ",{"$f":"777/128","v":6.0703125},7.9,6.99,"flubendiamide"]
[814.5,"INSECTICIDE","Belay 50WDG","Valent Chemical","Gal","OZ",270,290,280,"clothianidin"]
[814.8,"INSECTICIDE","Beleaf 50SG","FMC","LB","OZ",129.21,145,137.11000000000001,"flonicamid"]
[815,"INSECTICIDE","Bidrin","Amvac Chemical","GAL","OZ",{"$f":"1.17*128","v":149.76},129.28,139.52000000000001,"dicrotophos"]
[816,"INSECTICIDE","Biobit","Valent Chemical","LB","LB",null,null,0,"bacillus thuringiensis kurstaki"]
[817,"INSECTICIDE","Brigade 2EC","FMC","GAL","OZ",{"$f":"0.78*128","v":99.84},{"$f":"11.85*8","v":94.8},97.32,"bifenthrin","g."]
[817.5,"INSECTICIDE","Blackhawk","Dow AgroSciences","LB","OZ",{"$f":"5.35*16","v":85.6},93.01,89.31,"spinosad A and spinosad D"]
[817.6,"INSECTICIDE","Fanfare 2EC","MANA Crop Protection","GAL","OZ",null,126,126,"bifenthrin"]
[818,"INSECTICIDE","Capture LFR","FMC","GAL","OZ",275,{"$f":"2.28*128","v":291.83999999999997},283.42,"bifenthrin"]
[819,"INSECTICIDE","Carzol SP","Gowan Company","LB","LB",37.71,38.68,38.200000000000003,"formetanate hydrochloride"]
[819.5,"INSECTICIDE","Centric 40WG","Syngenta","OZ","OZ",4.22,4.62,4.42,"thiamethoxam"]
[819.8,"INSECTICIDE","Cobalt",null,null,"OZ",null,null,0,"chlorpyrifos + gamma-cyhalothrin"]
[820,"INSECTICIDE","Comite II 6.55EC","Chemtura","GAL","OZ",{"$f":"7.88*8","v":63.04},{"$f":"8.45*8","v":67.599999999999994},65.319999999999993,"propargite"]
[820.2,"INSECTICIDE","Confirm 2F",null,"GAL","OZ",{"$f":"2.06*128","v":263.68},248.32,256,"tebufenozide"]
[820.5,"INSECTICIDE","Coragen","Dupont","GAL","OZ",795,825,810,"rynaxypyr"]
[821,"INSECTICIDE","Counter 15G Smartbox",null,"LB","OZ",2.5499999999999998,3.35,2.95,"terbufos"]
[821.5,"INSECTICIDE","Counter 20 G Smartbox",null,"LB","OZ",2.65,3.35,3,"terbufos"]
[822,"INSECTICIDE","Crymax","Certis USA","LB","LB",14.8,15,14.9,"bacillus thuringiensis kurstaki"]
[822.5,"INSECTICIDE","Cygon 400",null,"GAL","PT",37.659999999999997,45,41.33,"dimethoate"]
[823,"INSECTICIDE","Cruiser 5FS","Syngenta","GAL","OZ",{"$f":"13.25*16","v":212},null,212,"thiamethoxam"]
[823.5,"INSECTICIDE","Curacron 8E","Syngenta","GAL","PT",{"$f":"10.37*8","v":82.96},87.12,85.04,"profenofos"]
[824,"INSECTICIDE","Danitol","Valent Chemical","GAL","OZ",132.72999999999999,150.36000000000001,141.55000000000001,"fenpropathrin"]
[825,"INSECTICIDE","Deadline","Amvac Chemical","LB","LB",1.8,2.08,1.94,"metaldehyde"]
[826,"INSECTICIDE","Denim .16 EC","Syngenta","GAL","OZ",242,218,230,"emamectin benzoate"]
[827,"INSECTICIDE","Diazinon AG500","MANA Crop Protection","GAL","PT",43.63,44,43.82,"diazinon"]
[827.5,"INSECTICIDE","Diazinon 50W","MANA Crop Protection","LB","LB",7.5,null,7.5,"diazinon"]
[828,"INSECTICIDE","Dibrom","Amvac Chemical","GAL","PT",null,null,0,"naled"]
[829,"INSECTICIDE","Dimethoate 4EC","Drexel Chemical","GAL","PT",{"$f":"5.63*8","v":45.04},{"$f":"5.31*8","v":42.48},43.76,"dimethoate"]
[830,"INSECTICIDE","Dimilin","Chemtura","GAL","OZ",{"$f":"1.73*128","v":221.44},{"$f":"1.45*128","v":185.6},203.52,"diflubenzuron"]
[831,"INSECTICIDE","DIPEL DF","Valent Chemical","LB","LB",10.5,9.75,10.130000000000001,"bacillus thuringiensis"]
[831.5,"INSECTICIDE","DIPEL ES","Valent Chemical","GAL","PT",38,{"$f":"4.89*8","v":39.119999999999997},38.56,"bacillus thuringiensis"]
[832,"INSECTICIDE","DISYSTON 15G","Bayer Crop Science","LB","LB",3.48,3.65,3.57,"disulfoton"]
[832.5,"INSECTICIDE","DISYSTON 8E","Bayer Crop Science","GAL","PT",{"$f":"14.32*8","v":114.56},121.12,117.84,"disulfoton"]
[833,"INSECTICIDE","DORMANT OIL","Helena","GAL","GAL",5.0999999999999996,4.9000000000000004,5,"dormant oil"]
[833.5,"INSECTICIDE","Empower II","Helena","LB","LB",2.85,2.99,2.92,"bifenthrin"]
[834,"INSECTICIDE","Endigo ZC","Syngenta","GAL","OZ",155,191.73,173.37,"cyhalothrin + thiamethoxam"]
[834.5,"INSECTICIDE","Entrust SC","Dow AgroSciences","OZ","OZ",10.17,null,10.17,"spinosad"]
[835,"INSECTICIDE","Force 3G","Syngenta","LB","LB",5.0999999999999996,6.03,5.57,"tefluthrin"]
[836,"INSECTICIDE","Fortress 5G Smartbox","Amvac Chemical","LB","LB",null,null,0,"chlorethoxyfos"]
[837,"INSECTICIDE","Fulfill","Syngenta","LB","OZ",5.95,6.75,6.35,"pymetrozine"]
[838,"INSECTICIDE","Furadan 4F","FMC","GAL","PT",{"$f":"10.36*8","v":82.88},{"$f":"9.81*8","v":78.48},80.680000000000007,"carbofuran"]
[839,"INSECTICIDE","Gaucho 600","Bayer Crop Science","GAL","OZ",null,{"$f":"2.35*128","v":300.8},300.8,"imidacloprid"]
[840,"INSECTICIDE","Guthion Solupak","MANA Crop Protection","LB","LB",10.68,null,{"$f":"ROUND(IF(G497=0,H497,IF(H497=0,G497,AVERAGE(G497,H497))),2)","v":10.68},"azinphos-methyl"]
[840.5,"INSECTICIDE","Hero 1.14EW","FMC","GAL","OZ",126.43,148,137.22,"zeta-cypermethrin + bifenthrin"]
[840.6,"INSECTICIDE","Hero 1.24EC","FMC","GAL","OZ",{"$f":"22.11*8","v":176.88},{"$f":"25.77*8","v":206.16},191.52,"zeta-cypermethrin + bifenthrin"]
[841,"INSECTICIDE","Imidan 70WSB","Gowan Company","LB","OZ",11,{"$f":"0.67*16","v":10.72},10.86,"phosmet"]
[841.5,"INSECTICIDE","Imidicloprid 2F","Amtide, LLC","GAL","OZ",62.13,{"$f":"0.78*128","v":99.84},80.989999999999995,"imidacloprid"]
[842,"INSECTICIDE","Incite","UAP Loveland","GAL","OZ",{"$f":"3.09*128","v":395.52},{"$f":"0.56*128","v":71.680000000000007},233.6,"piperonyl butoxide"]
[843,"INSECTICIDE","Intrepid","Dow AgroSciences","GAL","OZ",225,{"$f":"2*128","v":256},240.5,"methoxyfenozide"]
[844,"INSECTICIDE","Javelin WG","Certis USA","LB","LB",14.8,15.29,15.05,"bacillus thuringiensis kurstaki"]
[844.5,"INSECTICIDE","JMS Stylet-Oil","JMS Flower Farms","GAL","GAL",{"$f":"363/30","v":12.1},{"$f":"37.5/2.5","v":15},13.55,"paraffinic oil"]
[845,"INSECTICIDE","Karate Z","Syngenta","GAL","OZ",{"$f":"2.74*128","v":350.72},null,350.72,"lambda-cyhalothrin"]
[845.4,"INSECTICIDE","Kaiso 24WG","Nufarm","LB",null,null,null,0,"lambda-cyhalothrin on Sorbie Granules"]
[845.5,"INSECTICIDE","Dicofol 4E","MANA Crop Protection","GAL","PT",40.24,42,41.12,"dicofol"]
[846,"INSECTICIDE","Kernal Guard",null,"OZ","OZ",null,null,0,"diazinon + lindane"]
[847,"INSECTICIDE","Knack","Valent Chemical","GAL","OZ",{"$f":"86.07*8","v":688.56},null,688.56,"pyriproxyfen"]
[847.5,"INSECTICIDE","Kryocide",null,"LB","LB",null,null,0,"sodium aluminofluoride"]
[848,"INSECTICIDE","Lambda CY EC","UPI","GAL","PT",{"$f":"1.04*128","v":133.12},null,133.12,"lambda-cyhalothrin"]
[849,"INSECTICIDE","Lannate 90SP","DuPont","LB","OZ",28,29.28,28.64,"methomyl"]
[849.5,"INSECTICIDE","Lannate 2.4LV","DuPont","GAL","PT",76,{"$f":"10.88*8","v":87.04},81.52,"methomyl"]
[850,"INSECTICIDE","Larvin","Bayer Crop Science","GAL","OZ",72.959999999999994,69.36,71.16,"thiodicarb"]
[851,"INSECTICIDE","Lepinox WDG",null,"LB","LB",null,null,0,"bacillus thuringiensis"]
[851.5,"INSECTICIDE","Leverage 360","Bayer Crop Science","GAL","OZ",233.29,{"$f":"2.17*128","v":277.76},255.53,"cyfluthrin + imidacloprid"]
[852,"INSECTICIDE","Lime Sulfur","Miller Chemical","GAL","PT",13.24,13.6,13.42]
[853,"INSECTICIDE","Lorsban 15G","Dow AgroSciences","LB","LB",1.7,2.35,2.0299999999999998,"chlorpyrifos"]
[853.5,"INSECTICIDE","Lorsban Advanced 3.755EW",null,"GAL","PT",36,37.93,36.97,"chlorpyrifos"]
[853.6,"INSECTICIDE","Lorsban Generic. 4E","Various","GAL","PT",39,{"$f":"6.1*8","v":48.8},43.9,"chlorpyrifos"]
[854,"INSECTICIDE","Malathion 57%","UAP Platte","GAL","PT",35.92,{"$f":"4.23*8","v":33.840000000000003},34.880000000000003,"malathion "]
[854.5,"INSECTICIDE","Malathion 5E","Drexel Chemical","GAL","PT",{"$f":"4.09*8","v":32.72},34,33.36,"malathion "]
[855,"INSECTICIDE","Metasystox-R","Gowan Company","GAL","PT",92.75,null,92.75,"oxydementon methyl"]
[856,"INSECTICIDE","Cheminova methyl 4E","Cheminova","GAL","PT",34.08,{"$f":"4.84*8","v":38.72},36.4,"methyl parathion"]
[856.5,"INSECTICIDE","Mocap Lock'N Load","Bayer Crop Science","LB","LB",2.85,null,2.85,"ethoprop"]
[856.6,"INSECTICIDE","Mocap 6EC","Bayer Crop Science","GAL","QT",90,92,91,"ethoprop"]
[857,"INSECTICIDE","Monitor","Bayer Crop Science","GAL","PT",{"$f":"16.33*8","v":130.63999999999999},141,135.82,"methamidophos"]
[857.5,"INSECTICIDE","Movento","Bayer Crop Science","GAL","OZ",null,838.64,838.64,"spirotetramat"]
[858,"INSECTICIDE","M-Pede","Dow AgroSciences","GAL","GAL",null,18,18,"insecticidal soap"]
[859,"INSECTICIDE","Mustang Max","FMC","GAL","OZ",128.76,{"$f":"1.34*128","v":171.52},150.13999999999999,"zeta-cypermethrin"]
[860,"INSECTICIDE","Neemix","Certis USA","QT","OZ",169,null,169,"azadirachtin"]
[860.5,"INSECTICIDE","Novodor","Valent Chemical","GAL","QT",null,null,0,"bacillus thuringiensis tenebrionis"]
[860.9,"INSECTICIDE","Nuprid 4F",null,"GAL","OZ",null,{"$f":"0.88*128","v":112.64},112.64,"imidacloprid"]
[861,"INSECTICIDE","Oberon 4SC","Bayer Crop Science","GAL","OZ",{"$f":"59.84*8","v":478.72},null,478.72,"spiromesifen"]
[862,"INSECTICIDE","Orthene 75SP",null,"LB","LB",8,null,8,"acephate"]
[862.5,"INSECTICIDE","Orthene 90S","Amvac Chemical","LB","LB",6.5,6.6,6.55,"acephate"]
[863,"INSECTICIDE","Orthene 97 PE","Amvac Chemical","LB","LB",{"$f":"6/0.773","v":7.7619663648124186},8.25,8.01,"acephate"]
[863.5,"INSECTICIDE","Pasada 1.6F","MANA Crop Protection","GAL","OZ",{"$f":"2.2*128","v":281.60000000000002},292,286.8,"imidacloprid"]
[864,"INSECTICIDE","Penncap-M",null,"GAL","PT",null,{"$f":"8*5.9","v":47.2},47.2,"microencapsulated methyl parathion "]
[865,"INSECTICIDE","Phaser 3ME",null,"GAL","OZ",32,33,32.5,"clothianidin"]
[866,"INSECTICIDE","Platinum 2F","Syngenta","OZ","OZ",9.16,null,9.16,"thiamethoxam"]
[866.5,"INSECTICIDE","Platinum 75SG","Syngenta","OZ","OZ",4.7,null,4.7,"thiamethoxam"]
[866.6,"INSECTICIDE","T-MOXX 2F",null,"OZ","OZ",null,null,0,"thiamethoxam"]
[867,"INSECTICIDE","Pounce 25WP","FMC","LB","OZ",12.77,14.13,13.45,"permethrin"]
[867.5,"INSECTICIDE","Prevathon","DuPont","GAL","OZ",{"$f":"1.32*128","v":168.96},null,168.96,"chlorantaniliprole"]
[868,"INSECTICIDE","Proclaim","Syngenta","OZ","OZ",5.8,6.15,5.98,"emamectin benzoate"]
[869,"INSECTICIDE","Proaxis","Loveland Products","GAL","OZ",225,205,215,"gamma-cyhalothrin"]
[869.5,"INSECTICIDE","Prolex","Loveland Products","GAL","OZ",{"$f":"2.94*128","v":376.32},null,376.32,"gamma-cyhalothrin"]
[870,"INSECTICIDE","Provada 1.6","Bayer Crop Science","GAL","OZ",135,165,150,"imidacloprid"]
[870.2,"INSECTICIDE","Radiant SC","Dow AgroSciences","GAL","OZ",752,{"$f":"6.92*128","v":885.76},818.88,"spinetoram"]
[870.5,"INSECTICIDE","Regent 4SC","BASF","GAL","OZ",4.08,4.88,4.4800000000000004,"fipronil"]
[871,"INSECTICIDE","Scout X-Tra",null,null,null,null,null,0,"tralomethrin"]
[871.1,"INSECTICIDE","SEVIN 80S","Bayer Crop Science","LB","LB",7.35,7.5,7.43,"carbaryl"]
[871.2,"INSECTICIDE","SEVIN XLR Plus","Bayer Crop Science","GAL","PT",{"$f":"13.23*4","v":52.92},{"$f":"12.93*4","v":51.72},52.32,"carbaryl"]
[871.5,"INSECTICIDE","Carbaryl 4L","Drexel Chemical","GAL","PT",42.03,{"$f":"5.85*8","v":46.8},44.42,"carbaryl"]
[871.6,"INSECTICIDE","Carbaryl 80S","Drexel Chemical","LB","LB",2.5,null,2.5,"carbaryl"]
[871.8,"INSECTICIDE","Sevinmol-4",null,"GAL","PT",31.04,25.75,28.4,"carbaryl"]
[872,"INSECTICIDE","Stallion 15EC","FMC","GAL","PT",null,null,0,"zeta-cypermethrin + chlorpyrifos+"]
[872,"INSECTICIDE","Steward EC","DuPont","GAL","PT",{"$f":"31.2*8","v":249.6},254.9,252.25,"indoxacarb"]
[873,"INSECTICIDE","SpinTor 2SC","Dow AgroSciences","GAL","OZ",null,631.04,{"$f":"ROUND(IF(G561=0,H561,IF(H561=0,G561,AVERAGE(G561,H561))),2)","v":631.04},"spinosad"]
[873.5,"INSECTICIDE","Synapse WG","Bayer Crop Science","OZ","OZ",5.8,null,5.8,"flubendiamide"]
[874,"INSECTICIDE","Thimet 20G",null,"LB","LB",2.75,3.33,3.04,"phorate"]
[875,"INSECTICIDE","Thionex 3EC","MANA Crop Protection","GAL","QT",36.5,37.5,37,"endosulfan"]
[875.5,"INSECTICIDE","Thionex 50W","MANA Crop Protection","LB","LB",9.9,10.51,10.210000000000001,"endosulfan"]
[877,"INSECTICIDE","Tracer 4SC","Dow AgroSciences","GAL","OZ",950,1075,1012.5,"spinosad"]
[878,"INSECTICIDE","Trigard","Syngenta","OZ","OZ",null,null,0,"cyromazine"]
[878.5,"INSECTICIDE","Venom","Valent Chemical","LB","OZ",114,null,114,"dinotefuran"]
[879,"INSECTICIDE","Vydate C-LV","DuPont","GAL","PT",88.88,null,88.88,"oxamyl"]
[880,"INSECTICIDE","Warrior ZT","Syngenta","GAL","OZ",{"$f":"1.85*128","v":236.8},{"$f":"1.88*128","v":240.64},238.72,"lambda-cyhalothrin"]
[880.1,"INSECTICIDE","Warrior II w/ZT","Syngenta","GAL","OZ",250,275,262.5,"lambda-cyhalothrin"]
[880.5,"INSECTICIDE","Province","Tenkoz, Inc","GAL","OZ",138,null,138,"lambda-cyhalothrin"]
[880.6,"INSECTICIDE","Silencer 1EC","MANA Crop Protection","GAL","OZ",60.22,null,60.22,"lambda-cyhalothrin"]
[880.9,"INSECTICIDE","Widow","Loveland Products","GAL","OZ",133.33000000000001,160,146.66999999999999,"imidacloprid"]
[881,"INSECTICIDE","Xentara","Valent Chemical","LB","LB",12,13,12.5,"bacillus thuringiensis aizawai"]
[882,"INSECTICIDE","Zeal WSP","Valent Chemical","OZ","OZ",{"$f":"205/12","v":17.083333333333332},null,17.079999999999998,"etoxazole"]
[950]
[951,"NEMATICIDE","Mocap 15G","Bayer Crop Science","LB","LB",2.19,2.25,{"$f":"ROUND(IF(G578=0,H578,IF(H578=0,G578,AVERAGE(G578,H578))),2)","v":2.2200000000000002},"ethoprop"]
[954,"NEMATICIDE","Temik 15G","Bayer Crop Science","LB","LB",3.95,3.8,3.88,"aldicarb"]
[975,"Sucker Control","Contact (Various)",null,"GAL","GAL",16.75,14.5,15.63,"octanol and 1 decanol"]
[976,"Sucker Control","Off Shoot -T","Chemtura","GAL","GAL",13.5,14,13.75,"octanol and 1 decanol"]
[977,"Sucker Control","Sucker Plucker",null,"GAL","GAL",16.75,null,16.75]
[978,"Sucker Control","Super Sucker Stuff",null,"GAL","GAL",14.5,null,14.5]
[980,"Sucker Control","Butralin","Chemtura","GAL","GAL",72.010000000000005,76.69,74.349999999999994,"butralin"]
[985,"Sucker Control","Drexalin Plus","Drexel Chemical","GAL","GAL",59.25,70.599999999999994,64.930000000000007,"flumetralin"]
[990,"CHEMICAL","Aerial Application","20 acres minimum","ACRE","ACRE",5.5,8.5,7]
[999,"CHEMICAL","Ground Application",null,"ACRE","ACRE",7.5,9,8.25]
[970]
["Comments"]
[1001,"A soil insecticide / seed treatment  may be needed for Continous Corn. (Corn Rootworm Control)"]
[1002,"A soil insecticide / seed treatment  may be needed for Continous Corn Silage. (Corn Rootworm Control)"]
[1003,"An insecticide may be needed. (Cereal Leaf Beetle Control) "]
[1004,"Weed control depends on weed infestation."]
[1005]
[1009]
[1010]
[1011]
[1012,"Reference:  Vegetable Crop Handbook for Southeastern United States - 2017"]
[1013,"Chemical Type: H = Herbicide; I = Insecticide; F = Fungicide; G = Growth Regulator; X = Nemacides/Fumigants"]
[1014,"Chemical Type: H = Herbicide; I = Insecticide; F = Fungicide; G = Growth Regulator; D = Defoliant; X = Nemacides/Fumigants"]

{"sheet":"Machinery","index":2,"n_rows":294,"n_cols":17,"rows_kept":294,"cut":false,"hidden":false,"merged":[]}
["SELF-PROPELLED AND DRAWN IMPLEMENTS COST OF OPERATION AND OWNERSHIP"]
[null,null,null,null,null,null,null,null,null,"------ EXCLUDING TRACTOR -----",null,null,null,null,"------------- INCLUDING TRACTOR ---------"]
[null,null,"ESTIMATED","Fuel, Oil, Lube ","Repairs","TVC/","TFC/","TC/","HRS/","TVC/","TFC/","TC/","Fuel, Oil, Lube ","Repairs","TVC/","TFC/","TC/"]
["Code","MACHINE","COST","HOUR","HOUR","HOUR","HOUR","HOUR","AC","AC","AC","AC","AC","AC","AC","AC","AC"]
[]
["SELF-PROPELLED ITEMS (cost per hour)"]
[1,"TRACTOR 30-40 HP (1)",22700,5.75,2.1,7.85,3.26,11.11,"-","-","-","-","-","-","-","-","-"]
[2,"TRACTOR 50-60 HP (2)",34600,8.94,3.21,12.15,4.82,16.97,"-","-","-","-","-","-","-","-","-"]
[3,"TRACTOR 70-80 HP (3)",48600,12.32,4.5,16.82,6.65,23.47,"-","-","-","-","-","-","-","-","-"]
[4,"TRACTOR 95-105 HP (4)",76400,17.440000000000001,7.39,24.83,9.67,34.5,"-","-","-","-","-","-","-","-","-"]
[5,"TRACTOR 115-125 HP (5)",92200,20.97,8.92,29.89,11.6,41.49,"-","-","-","-","-","-","-","-","-"]
[6,"TRACTOR 135-155 HP (6)",134900,27.39,13.06,40.450000000000003,16.82,57.27,"-","-","-","-","-","-","-","-","-"]
[7,"TRACTOR 165-195 HP (7)",154200,37.159999999999997,14.68,51.84,15.27,67.11,"-","-","-","-","-","-","-","-","-"]
[8,"TRACTOR 200 - 245 HP (8)",194900,46.7,18.559999999999999,65.260000000000005,19.21,84.47,"-","-","-","-","-","-","-","-","-"]
[9,"TRACTOR >250 HP (9)",228200,55.93,21.73,77.66,22.44,100.1,"-","-","-","-","-","-","-","-","-"]
[11,"TRACTOR 30-40 HP (11) MFWD",29461,6.19,2.62,8.82,3.38,12.2,"-","-","-","-","-","-","-","-","-"]
[12,"TRACTOR 50-60 HP (12) MFWD",40176,9.23,3.58,12.81,4.5199999999999996,17.329999999999998,"-","-","-","-","-","-","-","-","-"]
[13,"TRACTOR 70-80 HP (13) MFWD",57000,12.77,5.08,17.84,6.32,24.16,"-","-","-","-","-","-","-","-","-"]
[14,"TRACTOR 95-105 HP (14) MFWD",81000,17.43,7.49,24.93,8.48,33.409999999999997,"-","-","-","-","-","-","-","-","-"]
[15,"TRACTOR 115-125 HP (15) MFWD",121200,22.9,11.21,34.11,12.56,46.67,"-","-","-","-","-","-","-","-","-"]
[16,"TRACTOR 135-155 HP (16) MFWD",152800,28.2,14.14,42.33,15.76,58.089999999999996,"-","-","-","-","-","-","-","-","-"]
[17,"TRACTOR 165-195 HP (17) MFWD",184300,28.48,17.54,46.02,18.2,64.22,"-","-","-","-","-","-","-","-","-"]
[18,"TRACTOR 200 - 245 HP (18) MFWD",243900,36.270000000000003,23.23,59.49,23.97,83.460000000000008,"-","-","-","-","-","-","-","-","-"]
[19,"TRACTOR 250-295 HP (19) MFWD",278000,43.33,26.47,69.8,27.27,97.07,"-","-","-","-","-","-","-","-","-"]
[20,"TRACTOR 300-400 HP (20) MFWD",336400,54.28,32.04,86.32,32.94,119.25999999999999,"-","-","-","-","-","-","-","-","-"]
[25.3,"Pickup Truck (3 gph)",33500,9.98,3.43,13.41,8.69,22.1,"-","-","-","-","-","-","-","-","-"]
[25.4,"Heavy Duty Diesel Pickup Truck (4 gph)",44000,13.28,4.51,17.79,11.28,29.07,"-","-","-","-","-","-","-","-","-"]
[25.5,"Full-size Diesel Truck (5 gph)",52500,16.46,5.38,21.83,13.38,35.21,"-","-","-","-","-","-","-","-","-"]
[27,"Skid-Steer Loader",30500,7.07,27.88,34.96,31.71,66.67,"-","-","-","-","-","-","-","-","-"]
["SELF-PROPELLED ITEMS (cost per acre &/or hour)"]
[35,"COMBINE (300 HP)",298000,63.22,105.02,168.24,150.44999999999999,318.69,"-","-","-","-","-","-","-","-","-"]
[35.5,"Used COMBINE (225 HP)",137500,63.77,38.49,102.26,56.1,158.36000000000001,0.26,"-","-","-",16.579999999999998,10.01,26.59,14.59,49.980000000000004]
[36,"COMBINE LARGE (340 HP)",341000,73.06,120.17,193.23,172.14,365.37,"-","-","-","-","-","-","-","-","-"]
[37,"COMBINE LARGE (340 HP) DC",341000,81.319999999999993,82.95,164.27,134.97999999999999,299.25,"-","-","-","-","-","-","-","-","-"]
[37.5,"Used COMBINE LARGE (340 HP)",190000,81.849999999999994,53.19,135.03,77.47,212.5,0.16,"-","-","-",13.1,8.51,21.6,12.4,43.55]
[39,"COMBINE LARGE (440 HP)",362500,84.97,127.75,212.72,182.98,395.7,"-","-","-","-","-","-","-","-","-"]
[40,"COMBINE LARGE (440 HP) DC",362500,93.75,88.18,181.93,143.47999999999999,325.40999999999997,"-","-","-","-","-","-","-","-","-"]
[41,"Forage Harvestor 2-Row KP (300HP)",272000,57.96,82.32,140.28,145.47,285.75,0.65,"-","-","-",37.67,53.51,91.18,94.56,156.16]
[42,"Forage Harvestor 4-Row KP (400HP)",334500,74.62,101.24,175.86,178.84,354.70000000000005,0.39,"-","-","-",29.1,39.479999999999997,68.59,69.75,107.17]
[51,"Used 185HP COTTON PICKER ",275000,166.13,101.85,267.98,159.97999999999999,427.96000000000004,0.33,"-","-","-",54.82,33.61,88.43,52.79,144.57999999999998]
[52,"COTTON PICKER 6-ROW",534000,203.65,197.77,401.43,310.43,711.86,0.19,"-","-","-",38.69,37.58,76.27,58.98,143.48000000000002]
[53,"COTTON STRIPPER",241300,104.94,70.930000000000007,175.87,113.58,289.45,0.25,"-","-","-",26.24,17.73,43.97,28.4,72.760000000000005]
[54,"COTTON PICKER/BALER 6-ROW",834200,318.14,308.95,627.1,484.82,1111.92,0.16,"-","-","-",50.9,49.43,100.34,77.569999999999993,170.82999999999998]
[61,"TOBACCO COMBINE 1-ROW",88500,29.79,26.11,55.89,58.52,114.41,1.53,"-","-","-",45.58,39.950000000000003,85.51,89.54,153.65]
[62,"TOBACCO COMBINE 2-ROW",147500,49.65,43.51,93.16,97.33,190.49,0.67,"-","-","-",33.270000000000003,29.15,62.42,65.209999999999994,170.72]
[71,"VEGETABLE PICKER  1-ROW",38000,17.71,8.6300000000000008,26.33,15.47,41.8,2.95,"-","-","-",52.24,25.46,77.67,45.64,131.66]
[72,"VEGETABLE PICKER  4-ROW",260000,124.67,31.68,156.35,89.27,245.62,0.98,"-","-","-",122.18,31.05,153.22,87.48,261.08]
[76,"Peanut Harvester (215 HP)",250000,116.49,56.64,173.12,100.65,273.77,0.31,"-","-","-",36.11,17.559999999999999,53.67,31.2,73.460000000000008]
[81,"HIBOY (100HP - 36FT)",103000,24.34,52.47,76.81,67.819999999999993,144.63,0.05,"-","-","-",1.22,2.62,3.84,3.39,3.51]
[82,"HIBOY (200HP - 60FT)",162500,42.94,82.78,125.72,106.76,232.48000000000002,0.03,"-","-","-",1.29,2.48,3.77,3.2,3.56]
[83,"Self-propelled Sprayer (500 gal. - 80FT)",185000,37.21,40.299999999999997,77.5,78.91,156.41,0.02,"-","-","-",0.74,0.81,1.55,1.58,2.2199999999999998]
[84,"Self-propelled Sprayer (800 gal.-100FT) GPS",218200,52.7,47.53,100.23,92.98,193.21,0.01,"-","-","-",0.53,0.48,1,0.93,1.47]
[90,"SP BALE WAGON (170 HP)",120000,56.08,22.53,78.61,36.770000000000003,115.38,0.12,"-","-","-",6.73,2.7,9.43,4.41,11.02]
[]
["DRAWN OR ATTACHED IMPLEMENTS"]
[101.2,"55HP + Plow 2X-16\"",1100,null,0.52,0.52,1,1.52,0.92,0.48,0.92,1.4,8.2200000000000006,3.44,11.66,5.35,21.200000000000003]
[101.3,"75HP + Plow 3X-16\"",3125,null,1.49,1.49,2.27,3.76,0.56999999999999995,0.85,1.29,2.14,7.02,3.42,10.44,5.08,19.78]
[101.4,"100HP + Plow 4X-16\"",5750,null,2.74,2.74,3.92,6.66,0.42,1.1499999999999999,1.65,2.8,7.32,4.26,11.58,5.71,21.93]
[101.6,"145MFWD + Plow 6X-18\" Adjustable",33157.5,null,15.81,15.81,21.09,36.9,0.25,3.95,5.27,9.2199999999999989,7.05,7.49,14.54,9.2100000000000009,31.72]
[101.8,"180MFWD + Plow 8X-18\" Adjustable",41851.5,null,19.95,19.95,26.53,46.480000000000004,0.19,3.79,5.04,8.83,5.41,7.12,12.53,8.5,29.810000000000002]
[102.3,"75MFWD + Reversable Plow 3X-18\"",13202,null,6.29,6.29,8.59,14.879999999999999,0.51,3.21,4.38,7.59,6.51,5.8,12.31,7.6,28.4]
[102.4,"100MFWD + Reversable Plow 4X-18\"",14192,null,6.77,6.77,9.2100000000000009,15.98,0.38,2.57,3.5,6.07,6.62,5.43,12.05,6.72,25]
[102.5,"120MFWD + Reversable Plow 5X-18\"",17273,null,8.24,8.24,11.14,19.380000000000003,0.31,2.5499999999999998,3.45,6,7.1,6.03,13.13,7.35,26.65]
[102.6,"145MFWD + Reversable Plow 6X-18\"",19502.5,null,9.3000000000000007,9.3000000000000007,12.53,21.83,0.25,2.33,3.13,5.46,7.05,5.86,12.91,7.07,25.83]
[102.8,"180MFWD + Reversable Plow 8X-18\"",21051,null,10.039999999999999,10.039999999999999,13.5,23.54,0.19,1.91,2.57,4.4799999999999995,5.41,5.24,10.65,6.02,22.98]
[103.1,"100MFWD + Chisel Plow 8FT",8524.25,null,3.39,3.39,4.7699999999999996,8.16,0.24,0.81,1.1399999999999999,1.95,4.18,2.62,6.8,3.18,12.73]
[103.2,"120MFWD + Chisel Plow 10FT",10959.75,null,4.3499999999999996,4.3499999999999996,6.04,10.39,0.16,0.7,0.97,1.67,3.66,2.4900000000000002,6.15,2.98,11.4]
[103.3,"145MFWD + Chisel Plow 12FT",13395.25,null,5.32,5.32,7.31,12.629999999999999,0.12,0.64,0.88,1.52,3.38,2.34,5.72,2.77,10.57]
[103.4,"180MFWD + Chisel Plow 16FT",18266.25,null,7.26,7.26,9.85,17.11,0.1,0.73,0.99,1.72,2.85,2.48,5.33,2.81,10.98]
[104.1,"225MFWD + Folding Chisel Plow 20FT",40313.25,null,16.02,16.02,21.36,37.379999999999995,0.15,2.4,3.2,5.6,5.44,5.89,11.33,6.8,24.77]
[104.2,"275MFWD + Folding Chisel Plow 24FT",48800.25,null,19.39,19.39,25.79,45.18,0.1,1.94,2.58,4.5199999999999996,4.33,4.59,8.92,5.31,19.57]
[104.3,"350MFWD + Folding Chisel Plow 32FT ",65774.25,null,26.13,26.13,34.65,60.78,0.08,2.09,2.77,4.8599999999999994,4.34,4.66,9,5.41,19.939999999999998]
[106,"100HP + Cultipacker - 13 FT",9138.5,null,7.19,7.19,6.5,13.690000000000001,0.2,1.44,1.3,2.74,3.49,2.91,6.4,3.23,11.61]
[107,"145MFWD+ Seedbed Finisher 20FT",14120.5,null,4.99,4.99,6.69,11.68,0.11,0.55000000000000004,0.74,1.29,3.1,2.11,5.21,2.4700000000000002,11.079999999999998]
[108.1,"75HP + Offset Disk 7 FT",8721,null,3.32,3.32,5.13,8.4499999999999993,0.31,1.03,1.59,2.62,3.82,2.42,6.24,3.65,12.71]
[108.2,"120MFWD + Offset Disk 12 FT",29121,null,11.09,11.09,16.510000000000002,27.6,0.18,2,2.97,4.9700000000000006,3.14,3.34,6.48,4.5,14.48]
[108.3,"180MFWD + Offset Disk 16 FT",37841,null,14.42,14.42,21.37,35.79,0.13,1.87,2.78,4.6500000000000004,3.7,4.16,7.86,5.14,17.61]
[109.1,"55HP + Tandem Disk Harrow 8FT Rigid",6955.5,null,2.65,2.65,4.1399999999999997,6.7899999999999991,0.27,0.72,1.1200000000000001,1.84,2.41,1.59,4,2.42,8.23]
[109.2,"75HP + Tandem Disk Harrow 11FT Rigid",12447.5,null,4.74,4.74,7.2,11.940000000000001,0.2,0.95,1.44,2.3899999999999997,2.46,1.85,4.3099999999999996,2.77,9.1999999999999993]
[109.3,"120HP + Tandem Disk Harrow 15FT Rigid",16385,null,6.24,6.24,9.4,15.64,0.14000000000000001,0.87,1.32,2.19,2.94,2.12,5.0599999999999996,2.94,10.210000000000001]
[109.4,"120HP + Tandem Disk Harrow 15FT Rigid",16385,null,6.24,6.24,9.4,15.64,0.14000000000000001,0.87,1.32,2.19,2.94,2.12,5.0599999999999996,2.94,10.210000000000001]
[110,"100HP + Perfecta Cultivator 15FT Rigid",22500,null,8.57,8.57,12.81,21.380000000000003,0.14000000000000001,1.2,1.79,2.99,2.44,2.2400000000000002,4.68,3.15,10.16]
[111.1,"180MFWD + Heavy Disk 18 FT",72673.5,null,27.68,27.68,40.799999999999997,68.47999999999999,0.27,7.47,11.02,18.489999999999998,7.69,12.21,19.899999999999999,15.93,49.25]
[111.2,"225MFWD + Heavy Disk 24 FT",78355.5,null,29.85,29.85,43.97,73.819999999999993,0.18,5.37,7.91,13.280000000000001,6.53,9.5500000000000007,16.079999999999998,12.23,38.68]
[111.3,"275MFWD + Heavy Disk 28 FT",103086,null,39.270000000000003,39.270000000000003,57.76,97.03,0.13,5.1100000000000003,7.51,12.620000000000001,5.63,8.5500000000000007,14.18,11.05,34.71]
[111.4,"350MFWD + Heavy Disk 32 FT",105595.5,null,40.229999999999997,40.229999999999997,59.16,99.389999999999986,0.09,3.62,5.32,8.9400000000000013,4.8899999999999997,6.5,11.39,8.2899999999999991,27.05]
[112,"55HP + Rotovator - 5 FT",7250,null,4.54,4.54,7.63,12.17,1.27,5.77,9.69,15.459999999999999,11.35,9.85,21.2,15.81,47.17]
[113,"55HP + Offset Disk Harrow 9 FT",10825,null,6.37,6.37,8.5,14.870000000000001,0.31,1.97,2.64,4.6100000000000003,2.77,2.97,5.74,4.13,12.45]
[113.5,"75HP + Offset Disk Harrow 9 FT",10825,null,6.37,6.37,8.5,14.870000000000001,0.31,1.97,2.64,4.6100000000000003,3.82,3.37,7.19,4.7,14.969999999999999]
[114,"100MFWD + Rotary Hoe 21 FT",14250,null,6.51,6.51,9.8000000000000007,16.310000000000002,0.06,0.39,0.59,0.98,1.05,0.84,1.89,1.1000000000000001,3.8]
[114.5,"140MFWD + Rotary Harrow 30 FT",26950,null,12.32,12.32,18.3,30.62,0.04,0.49,0.73,1.22,1.1299999999999999,1.06,2.19,1.36,4.4399999999999995]
[115,"140MFWD + Rotary Harrow 30 FT",26950,null,12.32,12.32,18.3,30.62,0.04,0.49,0.73,1.22,1.1299999999999999,1.06,2.19,1.36,4.4399999999999995]
[153,"75MFWD + Fertilizer Spreader",10750,null,10.52,10.52,15.56,26.08,0.12,1.26,1.87,3.13,1.53,1.87,3.4,2.63,7.9]
[154,"75MFWD + Fumigation Unit",6331,null,6.4,6.4,10.72,17.12,0.43,2.75,4.6100000000000003,7.36,5.49,4.93,10.42,7.33,23.049999999999997]
[161,"100MFWD + Strip-Till Rig 4R",13465.5,null,5.13,5.13,7.77,12.899999999999999,0.22,1.1299999999999999,1.71,2.84,3.83,2.78,6.61,3.58,13.06]
[161.5,"145MFWD + Strip-Till Rig 6R",19301.5,null,7.35,7.35,11.03,18.38,0.14000000000000001,1.03,1.54,2.5700000000000003,3.95,3.01,6.96,3.75,13.370000000000001]
[162,"180MFWD + Strip-Till Rig 8R",20539.5,null,7.82,7.82,11.72,19.54,0.11,0.86,1.29,2.15,3.13,2.79,5.92,3.29,12.35]
[163,"275MFWD + Strip-Till Rig 12R",28175,null,10.73,10.73,15.98,26.71,7.0000000000000007E-2,0.75,1.1200000000000001,1.87,2.54,2.38,4.92,2.8,13.26]
[200.1,"75HP + Grain Drill 10 FT - 10\"",17214,null,11.34,11.34,12.95,24.29,0.23,2.61,2.98,5.59,2.83,3.65,6.48,4.51,14.93]
[200.2,"100HP + Grain Drill 15 FT - 10\"",19976,null,13.16,13.16,14.97,28.130000000000003,0.15,1.97,2.25,4.22,2.62,3.08,5.7,3.7,12.55]
[200.4,"100HP + Grain Drill 15 FT - 7.5\"",23838.5,null,15.7,15.7,17.79,33.489999999999995,0.15,2.36,2.67,5.0299999999999994,2.62,3.46,6.08,4.12,13.75]
[200.6,"145MFWD + Grain Drill 20 FT - 7.50\"",30151,null,19.86,19.86,22.4,42.26,0.11,2.1800000000000002,2.46,4.6400000000000006,2.52,3.42,5.94,3.85,13.04]
[200.8,"145MFWD + Grain Drill 20 FT - 6\"",34896.5,null,22.98,22.98,25.87,48.85,0.11,2.5299999999999998,2.85,5.38,2.52,3.76,6.28,4.2300000000000004,14.129999999999999]
[205.4,"75MFWD + Mulch  Bedder-Layer 4FT Center",5550,null,5.36,5.36,8.3699999999999992,13.73,0.65,3.48,5.44,8.92,8.3000000000000007,6.78,15.08,9.5500000000000007,31.2]
[205.5,"75MFWD + Mulch  Bedder-Layer 5FT Center",5550,null,5.36,5.36,8.3699999999999992,13.73,0.52,2.79,4.3499999999999996,7.14,6.64,5.42,12.06,7.64,24.96]
[205.6,"75MFWD + Mulch  Bedder-Layer 6FT Center",5550,null,5.36,5.36,8.3699999999999992,13.73,0.44,2.36,3.68,6.04,5.62,4.59,10.210000000000001,6.46,21.119999999999997]
[205.8,"75MFWD + Mulch  Bedder-Layer 8FT Center",5550,null,5.36,5.36,8.3699999999999992,13.73,0.33,1.77,2.76,4.5299999999999994,4.21,3.45,7.66,4.8499999999999996,15.84]
[206,"180MFWD + Mulch  Bedder-Layer 3R 6FT",16350,null,15.8,15.8,24,39.799999999999997,0.15,2.37,3.6,5.9700000000000006,3.44,4.05,7.49,5.48,15.11]
[207,"75MFWD + No-till Drill 10 FT",38161.5,null,25.13,25.13,28.26,53.39,0.26,6.53,7.35,13.879999999999999,3.32,7.85,11.17,8.99,28.16]
[207.5,"120MFWD + No-till Drill 15 FT",54152.5,null,35.659999999999997,35.659999999999997,39.950000000000003,75.61,0.17,6.06,6.79,12.85,3.89,7.97,11.86,8.93,27.75]
[207.8,"180MFWD + No-till Drill 20 FT",73471.5,null,48.38,48.38,54.07,102.45,0.13,6.29,7.03,13.32,3.7,8.57,12.27,9.4,30.78]
[209.2,"55HP + Precision Vacuum Seeder 2R",8692.5,null,4.34,4.34,5.41,9.75,0.46,2,2.4900000000000002,4.49,4.1100000000000003,3.48,7.59,4.71,17.47]
[209.4,"100HP + Precision Vacuum Seeder 4R",17205,null,8.58,8.58,10.33,18.91,0.2,1.72,2.0699999999999998,3.79,3.49,3.19,6.68,4,15.120000000000001]
[210,"35HP + Planter 1-Row-48",7000,null,4.75,4.75,6.51,11.26,1.65,7.84,10.74,18.579999999999998,9.49,11.3,20.79,16.12,46.45]
[211,"55HP + Planter 2-Row-36",14000,null,9.51,9.51,12.62,22.13,0.89,8.4600000000000009,11.23,19.690000000000001,7.96,11.32,19.28,15.52,44.6]
[212.4,"75HP + Planter 4-Row-30",23265.5,null,11.6,11.6,13.84,25.439999999999998,0.27,3.13,3.74,6.87,3.33,4.34,7.67,5.53,20.07]
[212.6,"100HP + Planter 6-Row-30",31991,null,15.96,15.96,18.88,34.840000000000003,0.18,2.87,3.4,6.27,3.14,4.2,7.34,5.14,18.760000000000002]
[212.8,"120MFWD + Planter 8-Row-30",37902,null,18.899999999999999,18.899999999999999,22.3,41.2,0.15,2.84,3.35,6.1899999999999995,3.44,4.51,7.95,5.23,19.43]
[212.9,"145MFWD + Planter 12-Row-30",53804.5,null,26.84,26.84,31.51,58.35,0.1,2.68,3.15,5.83,2.82,4.0999999999999996,6.92,4.7300000000000004,17.38]
[214.5,"180MFWD + No-till 12/23 Split-Row Planter",116483,null,58.1,58.1,67.77,125.87,0.17,9.8800000000000008,11.52,21.4,4.84,12.86,17.7,14.61,52.730000000000004]
[215.4,"75HP + Planter No-till 4-Row",30089.5,null,15.01,15.01,17.78,32.79,0.24,3.6,4.2699999999999996,7.8699999999999992,2.96,4.68,7.64,5.86,21.009999999999998]
[215.6,"100MFWD + Planter No-till 6-Row",37109,null,18.510000000000002,18.510000000000002,21.85,40.36,0.19,3.52,4.1500000000000004,7.67,3.31,4.9400000000000004,8.25,5.76,21.490000000000002]
[215.8,"145MFWD + Planter No-till 8-Row",44726,null,22.31,22.31,26.25,48.56,0.16,3.57,4.2,7.77,3.66,5.37,9.0299999999999994,6.21,22.84]
[215.9,"180MFWD + Planter No-till 12-Row",64040.5,null,31.94,31.94,37.43,69.37,0.1,3.19,3.74,6.93,2.85,4.95,7.8,5.56,20.86]
[218.4,"100MFWD + Planter No-till W/ Sprayer 4R",31372,null,15.65,15.65,18.53,34.18,0.28000000000000003,4.38,5.19,9.57,4.88,6.48,11.36,7.56,28.56]
[218.6,"120MFWD + Planter No-till W/ Sprayer 6R",38781.5,null,19.34,19.34,22.81,42.15,0.18,3.48,4.1100000000000003,7.59,4.12,5.5,9.6199999999999992,6.37,23.619999999999997]
[218.8,"180MFWD + Planter No-till W/ Sprayer 8R",65133.5,null,32.49,32.49,38.06,70.550000000000011,0.14000000000000001,4.55,5.33,9.879999999999999,2.44,5.6,8.0399999999999991,6.52,23.43]
[218.9,"225MFWD + Planter No-till W/ Sprayer 12R",56902,null,28.38,28.38,33.299999999999997,61.679999999999993,0.09,2.5499999999999998,3,5.55,3.26,4.6500000000000004,7.91,5.15,19.77]
[222.4,"100HP + Planter W/ Sprayer 4R",20090,null,10.02,10.02,12,22.02,0.27,2.71,3.24,5.95,4.71,4.7,9.41,5.85,21.92]
[222.6,"120MFWD + Planter W/ Sprayer 6R",29700,null,14.81,14.81,17.559999999999999,32.369999999999997,0.18,2.67,3.16,5.83,3.77,4.28,8.0500000000000007,5.25,19.509999999999998]
[222.8,"145MFWD + Planter W/ Sprayer 8R",38100,null,19,19,22.42,41.42,0.15,2.85,3.36,6.21,4.2699999999999996,5.48,9.75,6.09,23.759999999999998]
[222.9,"225MFWD + Planter W/ Sprayer 12R",54950,null,27.41,27.41,32.17,59.58,0.09,2.4700000000000002,2.9,5.37,3.26,4.5599999999999996,7.82,5.05,19.43]
[225.2,"75MFWD + Ripper-Bedder 2R",6400,null,2.0299999999999998,2.0299999999999998,2.99,5.0199999999999996,0.32,0.65,0.96,1.6099999999999999,4.09,2.27,6.36,2.98,13.79]
[225.4,"145MFWD + Ripper-Bedder 4R",14625,null,4.6500000000000004,4.6500000000000004,6.42,11.07,0.17,0.79,1.0900000000000001,1.8800000000000001,4.79,3.2,7.99,3.77,15.8]
[227.4,"275MFWD + Ripper Bedder 8R",29250,null,13.95,13.95,18.64,32.590000000000003,0.12,1.67,2.2400000000000002,3.91,5.2,4.8499999999999996,10.050000000000001,5.51,20.77]
[227.8,"275MFWD + Ripper Bedder 8R",29250,null,13.95,13.95,18.64,32.590000000000003,0.12,1.67,2.2400000000000002,3.91,5.2,4.8499999999999996,10.050000000000001,5.51,20.77]
[228.6,"180MFWD + Subsoiler-NT Planter 6R",43739,null,20.85,20.85,27.72,48.57,0.16,3.34,4.4400000000000004,7.78,4.5599999999999996,6.14,10.7,7.35,25.630000000000003]
[228.8,"180MFWD + Subsoiler-NT Planter 8R",53566,null,25.54,25.54,33.869999999999997,59.41,0.12,3.06,4.0599999999999996,7.1199999999999992,4.3499999999999996,5.85,10.199999999999999,6.94,24.240000000000002]
[228.9,"225MFWD + Subsoiler-NT Planter 12R",77300.5,null,36.86,36.86,48.74,85.6,0.08,2.95,3.9,6.85,3.47,5.0599999999999996,8.5299999999999994,6.08,20.95]
[229.4,"145MFWD+Subsoiler-Planter W/Spray 4R",24510,null,11.69,11.69,15.67,27.36,0.24,2.81,3.76,6.57,6.77,6.19,12.96,7.54,26.86]
[229.6,"225MFWD+Subsoiler-Planter W/Spray 6R",36330,null,17.32,17.32,23.07,40.39,0.16,2.77,3.69,6.46,4.5599999999999996,5.57,10.130000000000001,6.6,23.58]
[229.8,"275MFWD+Subsoiler-Planter W/Spray 8R",46940,null,22.38,22.38,29.72,52.099999999999994,0.12,2.69,3.57,6.26,3.42,4.79,8.2100000000000009,5.75,19.89]
[229.9,"350MFWD+Subsoiler-Planter W/Spray 12R",68210,null,32.520000000000003,32.520000000000003,43.05,75.569999999999993,0.08,2.6,3.44,6.04,2.9,4.46,7.36,5.36,18.18]
[232,"75HP + Super Bedder 1-ROW",3200,null,3.09,3.09,4.97,8.0599999999999987,1.1000000000000001,3.4,5.47,8.8699999999999992,13.55,8.35,21.9,12.78,41.81]
[232.5,"75HP + Power Bedder 1-ROW",9200,null,8.89,8.89,13.65,22.54,1.1000000000000001,9.7799999999999994,15.02,24.799999999999997,13.55,14.73,28.28,22.33,59.81]
[233,"75HP + Tomato Transplanter 3R",8250,null,5.6,5.6,7.6,13.2,0.69,3.86,5.24,9.1,8.5,6.97,15.47,9.83,31.98]
[233.5,"75HP + Transplanter Triple Row",5150,null,3.5,3.5,4.9000000000000004,8.4,2.75,9.6300000000000008,13.48,23.11,33.880000000000003,22,55.88,31.76,109.83]
[234,"35HP + Transplanter 1-Row",1900,null,1.29,1.29,2.06,3.35,2.2000000000000002,2.84,4.53,7.37,12.65,7.46,20.11,11.7,38.72]
[235,"55HP + Transplanter 2-Row",3250,null,2.21,2.21,3.24,5.45,1.38,3.05,4.47,7.52,12.34,7.48,19.82,11.12,38.46]
[236,"75HP + Transplanter 4-Row",10250,null,5.22,5.22,7.11,12.33,0.83,4.33,5.9,10.23,10.23,8.06,18.29,11.42,40.239999999999995]
[237,"55HP + Water Wheel transplanter 1R",2500,null,1.7,1.7,2.59,4.29,2.06,3.5,5.34,8.84,18.420000000000002,10.11,28.53,15.26,54.22]
[240,"145MFWD Spin Spreader 5-Ton",10900,null,10.67,10.67,15.78,26.45,0.09,0.96,1.42,2.38,2.06,1.97,4.03,2.5499999999999998,8.06]
[251,"35HP + Cultivator 1-Row",3000,null,1.41,1.41,2.57,3.9799999999999995,1.18,1.66,3.03,4.6899999999999995,6.79,4.1399999999999997,10.93,6.88,21.89]
[251.2,"55HP + Cultivator 2-Row",4350,null,2.04,2.04,3.6,5.6400000000000006,0.42,0.86,1.51,2.37,3.75,2.21,5.96,3.54,11.850000000000001]
[251.4,"100HP + Cultivator 4-Row",10800,null,4.7699999999999996,4.7699999999999996,6.41,11.18,0.23,1.1000000000000001,1.47,2.5700000000000003,4.01,2.8,6.81,3.7,13.82]
[251.5,"120HP + Cultivator 4-Row",10800,null,4.7699999999999996,4.7699999999999996,6.41,11.18,0.23,1.1000000000000001,1.47,2.5700000000000003,4.82,3.15,7.97,4.1399999999999997,15.8]
[251.6,"145MFWD + Cultivator 6-Row",21118,null,7.46,7.46,9.9,17.36,0.18,1.34,1.78,3.12,5.08,3.88,8.9600000000000009,4.62,18.759999999999998]
[251.8,"180MFWD + Cultivator 8-Row",19900,null,7.03,7.03,9.35,16.38,0.14000000000000001,0.98,1.31,2.29,5.08,4.2300000000000004,9.31,4.66,19.89]
[251.9,"200MFWD + Cultivator 12-Row",34800,null,12.29,12.29,16.18,28.47,0.09,1.1100000000000001,1.46,2.5700000000000003,3.9,3.49,7.39,3.91,16.68]
[255.4,"120MFWD + Cultivator W/Chem 4-Row",16050,null,7.54,7.54,12.47,20.010000000000002,0.25,1.89,3.12,5.01,5.73,4.68,10.41,6.26,20.57]
[255.6,"145MFWD + Cultivator W/Chem 6-Row",22800,null,10.71,10.71,17.600000000000001,28.310000000000002,0.18,1.93,3.17,5.0999999999999996,5.08,4.47,9.5500000000000007,6,19.189999999999998]
[255.8,"180MFWD + Cultivator W/Chem 8-Row",31250,null,14.68,14.68,24.01,38.69,0.14000000000000001,2.06,3.36,5.42,3.99,4.51,8.5,5.91,18.96]
[255.9,"225MFWD + Cultivator W/Chem 12-Row",41800,null,19.64,19.64,32.01,51.65,0.09,1.77,2.88,4.6500000000000004,3.26,3.86,7.12,5.04,15.969999999999999]
[259,"75HP + Granular Applicator",3575,null,1.75,1.75,2.88,4.63,0.56000000000000005,0.98,1.61,2.59,6.9,3.5,10.4,5.34,20.46]
[260,"100MFWD + PTO Air Blast Sprayer (500g)",18250,null,11.16,11.16,16.489999999999998,27.65,0.2,2.23,3.3,5.5299999999999994,3.49,3.73,7.22,4.99,13.82]
[261.2,"55HP + Boom sprayer - 18FT",7000,null,6.41,6.41,7.9,14.31,0.25,1.6,1.98,3.58,2.2400000000000002,2.4,4.6399999999999997,3.18,9.67]
[261.39999999999998,"75MFWD + Boom sprayer - 18FT",7000,null,6.41,6.41,7.9,14.31,0.15,0.96,1.19,2.15,1.92,1.72,3.64,2.13,7.5600000000000005]
[261.5,"75HP + Boom sprayer - 30FT",12200,null,11.17,11.17,13.57,24.740000000000002,0.09,1.01,1.22,2.23,1.1100000000000001,1.41,2.52,1.82,5.3800000000000008]
[261.60000000000002,"100MFWD + Boom sprayer - 8R 24FT",13400,null,6.56,6.56,9.83,16.39,0.11,0.72,1.08,1.8,1.92,1.54,3.46,2.0099999999999998,7.1]
[261.8,"120MFWD + Boom sprayer - 60FT",27800,null,25.45,25.45,30.58,56.03,0.05,1.27,1.53,2.8,1.1499999999999999,1.83,2.98,2.16,6.2799999999999994]
[263.2,"55HP + Sidedress Attachment 2R",1600,null,0.78,0.78,1.48,2.2599999999999998,0.42,0.33,0.62,0.95,5.17,2.2200000000000002,7.39,3.41,13.669999999999998]
[263.39999999999998,"100HP + Sidedress Attachment 4R",2700,null,1.32,1.32,2.2599999999999998,3.58,0.21,0.28000000000000003,0.47,0.75,4.4000000000000004,2.15,6.55,2.91,11.84]
[264,"75MFWD + Sprayer Blower 20FT+",17500,null,10.7,10.7,15.83,26.53,0.18,1.93,2.85,4.78,2.2999999999999998,2.84,5.14,3.99,11.540000000000001]
[265,"55HP +  Mounted Sprayer",5000,null,3.06,3.06,4.7699999999999996,7.83,0.16,0.49,0.76,1.25,1.43,1,2.4300000000000002,1.53,4.99]
[266,"55HP + Weed Wiper",5450,null,5.92,5.92,6.35,12.27,0.1,0.59,0.64,1.23,0.89,0.92,1.81,1.1200000000000001,3.37]
[270,"55HP + Mulch Lifter",2025,null,1.9,1.9,3.37,5.27,1.06,2.0099999999999998,3.57,5.58,9.48,5.41,14.89,8.68,28.509999999999998]
[271,"55HP + Mulch Lifter & Wrapper 1R",3212.5,null,3.02,3.02,5.17,8.19,1.06,3.2,5.48,8.68,9.48,6.6,16.079999999999998,10.59,32.07]
[301,"55HP + Rotary Mower - 6 FT",11024,null,5.18,5.18,8.67,13.85,0.56999999999999995,2.95,4.9400000000000004,7.8900000000000006,5.0999999999999996,4.78,9.8800000000000008,7.69,25.59]
[302,"75HP + Rotary Mower - 9 FT",13377.5,null,6.28,6.28,10.46,16.740000000000002,0.38,2.39,3.97,6.36,4.68,4.0999999999999996,8.7799999999999994,6.5,22.08]
[303,"100HP + Rotary Mower - 12 FT",15109,null,7.09,7.09,11.78,18.869999999999997,0.28999999999999998,2.06,3.42,5.48,5.0599999999999996,4.2,9.26,6.22,21.700000000000003]
[311,"75HP + Rotary Mower-Cond. - 9FT",25555.5,null,12,12,19.72,31.72,0.28000000000000003,3.36,5.52,8.879999999999999,3.45,4.62,8.07,7.38,19.12]
[312,"75HP + Mower-Conditioner - 9 FT",14000,null,6.57,6.57,10.93,17.5,0.28000000000000003,1.84,3.06,4.9000000000000004,3.45,3.1,6.55,4.92,14.190000000000001]
[313,"100HP + Disc Mower-Conditioner - 12FT",37699,null,17.7,17.7,28.95,46.65,0.21,3.72,6.08,9.8000000000000007,3.66,5.27,8.93,8.11,20.97]
[321,"75HP + Round Baler PTO 750#",31027.5,null,14.84,14.84,28.45,43.29,0.26,3.86,7.4,11.26,3.2,5.03,8.23,9.1300000000000008,24.27]
[322,"100MFWD + Round Baler PTO 1500#",46848.5,null,22.41,22.41,42.79,65.2,0.26,5.83,11.13,16.96,4.53,7.78,12.31,13.33,35.869999999999997]
[323,"100MFWD + Round Baler PTO Silage",54066.5,null,25.86,25.86,49.34,75.2,0.26,6.72,12.83,19.55,4.53,8.68,13.21,15.03,39.75]
[326,"55HP + Square Baler PTO Twine",23449,null,11.22,11.22,21.58,32.799999999999997,0.26,2.92,5.61,8.5300000000000011,2.3199999999999998,3.76,6.08,6.86,16.16]
[326.5,"80HP + 16x18 Square Baler PTO Twine",26930,null,12.88,12.88,24.74,37.619999999999997,0.26,3.35,6.43,9.7799999999999994,3.2,4.5199999999999996,7.72,8.16,19.86]
[327,"80HP + Square Baler + Hyd. Accumulator ",37630,null,18,18,34.44,52.44,0.26,4.68,8.9499999999999993,13.629999999999999,3.2,5.85,9.0500000000000007,10.68,24.72]
[328,"80HP + Square Baler + Bale Bander",80930,null,38.71,38.71,73.69,112.4,0.26,10.06,19.16,29.22,3.2,11.24,14.44,20.89,44.41]
[329,"80HP + Bale Pickup Wagon",30000,null,14.35,14.35,27.52,41.87,0.26,3.73,7.16,10.89,3.2,4.9000000000000004,8.1,8.8800000000000008,21.25]
[330,"145MFWD + Lg Rectangler Baler 3x3",95000,null,29.44,29.44,49.18,78.62,0.12,3.53,5.9,9.43,3.38,5.23,8.61,7.79,20.71]
[331,"55HP + Side Delivery Rake - 9 FT",8345,null,5.05,5.05,9.16,14.21,0.23,1.1599999999999999,2.11,3.2699999999999996,2.06,1.9,3.96,3.22,8.49]
[332,"75HP + Side Delivery Rake -11 FT",9292.5,null,5.62,5.62,10.17,15.79,0.19,1.07,1.93,3,2.34,1.92,4.26,3.2,8.8999999999999986]
[333,"120HP + Dual Side Delivery Rakes",30158.5,null,18.260000000000002,18.260000000000002,32.46,50.72,0.11,2.0099999999999998,3.57,5.58,2.31,2.99,5.3,4.8499999999999996,11.87]
[336,"55HP + Wheel Rake - 18 FT",7433.5,null,4.5,4.5,8.19,12.69,0.11,0.5,0.9,1.4,0.98,0.85,1.83,1.43,3.87]
[337,"55HP + Wheel Rake - 27 FT",21150.5,null,12.8,12.8,22.84,35.64,0.08,1.02,1.83,2.85,0.72,1.28,2,2.21,4.8900000000000006]
[341,"35HP + Sickle Mower - 6 FT",5032,null,4.72,4.72,7.94,12.66,0.39,1.84,3.1,4.9400000000000004,2.2400000000000002,2.66,4.9000000000000004,4.37,10.54]
[342,"55HP + Sickle Mower - 7.5 FT",5188,null,4.87,4.87,8.18,13.05,0.32,1.56,2.62,4.18,2.86,2.59,5.45,4.16,11.17]
[350,"75HP + SILAGE BLOWER",3250,null,1.59,1.59,2.65,4.24,0.47,0.75,1.25,2,5.79,2.86,8.65,4.37,16.22]
[351,"100MFWD + Forage Harvestor Pkup                  6Ft",34673,null,15.74,15.74,28.02,43.76,0.63,9.92,17.649999999999999,27.57,10.98,14.64,25.62,23,51.16]
[352,"100MFWD + Forage Harvestor 2R                     6FT",34955.5,null,13.22,13.22,23.58,36.799999999999997,0.56999999999999995,7.54,13.44,20.98,9.94,11.81,21.75,18.27,46.47]
[353,"120MFWD+Forage Harvestor KP 2R                  5Ft",46998,null,17.78,17.78,31.62,49.400000000000006,0.69,12.27,21.82,34.090000000000003,15.8,20,35.799999999999997,30.48,76.099999999999994]
[354,"75HP + Silage Wagon",23000,null,11.25,11.25,16.63,27.88,0.56999999999999995,6.41,9.48,15.89,7.02,8.98,16,13.27,35.67]
[355,"100HP + Silage Wagon Dump",29000,null,14.19,14.19,20.87,35.06,0.56999999999999995,8.09,11.9,19.990000000000002,9.94,12.3,22.24,17.41,48.03]
[361,"35HP + Tedder - 10 FT",3161,null,1.98,1.98,3.5,5.48,0.2,0.4,0.7,1.1000000000000001,1.1499999999999999,0.82,1.97,1.35,3.9299999999999997]
[362,"55HP + Tedder - 17 FT",10114,null,6.33,6.33,10.54,16.869999999999997,0.12,0.76,1.26,2.02,1.07,1.1499999999999999,2.2200000000000002,1.84,4.83]
[362.5,"75HP + Tedder - 26 FT",22196,null,13.89,13.89,22.79,36.68,0.08,1.1100000000000001,1.82,2.93,0.99,1.47,2.46,2.36,5.6999999999999993]
[381,"Combine + Grain Table 20 FT",33697,null,9.6300000000000008,9.6300000000000008,16.940000000000001,26.57,0.2,1.93,3.39,5.32,12.64,22.93,35.57,33.479999999999997,65.67]
[382,"Combine + Grain Table 25 FT",36583,null,10.46,10.46,18.37,28.830000000000002,0.16,1.67,2.94,4.6099999999999994,13.01,14.95,27.96,24.54,62.42]
[383,"Lg Combine + Grain Table 30FT",42882,null,12.26,12.26,21.48,33.74,0.13,1.59,2.79,4.38,12.19,13.05,25.24,21.44,51.39]
[384,"Combine + Corn Head 15 FT",64506.5,null,18.440000000000001,18.440000000000001,32.19,50.629999999999995,0.26,4.79,8.3699999999999992,13.16,16.440000000000001,32.1,48.54,47.49,91.58]
[385,"Lg Combine + Corn Head 20FT",82240,null,23.51,23.51,40.96,64.47,0.2,4.7,8.19,12.89,16.260000000000002,21.3,37.56,35.19,85.11]
[386,"Lg Combine + Corn Head 30FT",126892.5,null,36.28,36.28,63.06,99.34,0.13,4.72,8.1999999999999993,12.919999999999998,12.19,16.18,28.37,26.85,59.879999999999995]
[387,"Combine + Soybean Head 20FT",33697,null,9.6300000000000008,9.6300000000000008,16.940000000000001,26.57,0.2,1.93,3.39,5.32,12.64,22.93,35.57,33.479999999999997,65.67]
[388,"Combine + Soybean Head 22FT",35435,null,10.130000000000001,10.130000000000001,17.8,27.93,0.18,1.82,3.2,5.0200000000000005,13.15,23.45,36.6,34.19,78.599999999999994]
[389,"Lg Combine+Soybean Head 25FT",36583,null,10.46,10.46,18.37,28.830000000000002,0.16,1.67,2.94,4.6099999999999994,13.01,14.95,27.96,24.54,62.42]
[390,"Lg Combine+Soybean Head 30FT",40882,null,11.69,11.69,20.49,32.18,0.13,1.52,2.66,4.18,12.19,12.98,25.17,21.32,51.19]
[395.1,"100MFWD+Gravity Grain Wagon, 240 Bu",8000,null,7.83,7.83,11.67,19.5,0.15,1.17,1.75,2.92,2.61,2.2999999999999998,4.91,3.02,9.31]
[396.1,"145MFWD+Grain Cart, 500 Bu",26100,null,8.51,8.51,12.66,21.17,0.02,0.17,0.25,0.42000000000000004,0.56000000000000005,0.46,1.02,0.56999999999999995,1.96]
[396.2,"180MFWD+Grain Cart, 750 Bu",34000,null,11.09,11.09,16.39,27.48,0.02,0.22,0.33,0.55000000000000004,0.56999999999999995,0.56999999999999995,1.1399999999999999,0.69,2.4299999999999997]
[396.3,"225MFWD+Grain Cart, 1000 Bu",45150,null,14.73,14.73,21.65,36.379999999999995,0.02,0.28999999999999998,0.43,0.72,0.73,0.75,1.48,0.91,3.17]
[396.4,"275MFWD+Grain Cart, 1050+ ",57375,null,18.71,18.71,27.42,46.13,0.02,0.37,0.55000000000000004,0.92,0.87,0.9,1.77,1.0900000000000001,3.8]
[400,"75MFWD+Bale Carrier - 3 Pt hitch",3000,null,0.23,0.23,0.69,0.91999999999999993,0.17,0.04,0.12,0.16,2.17,0.9,3.07,1.19,5.7200000000000006]
[401,"55HP + Bale Wagon w/racks",5000,null,1.63,1.63,2.71,4.34,0.17,0.28000000000000003,0.46,0.74,1.52,0.82,2.34,1.28,4.51]
[401.5,"Pickup + Bale Wagons (5 mph)",5000,null,1.63,1.63,2.71,4.34,0.17,0.28000000000000003,0.46,0.74,9.23,5.72,14.95,6.06,27.86]
[402,"75HP + 3 Ton Hay Stacker 12FT",30000,null,9.7899999999999991,9.7899999999999991,14.5,24.29,0.34,3.33,4.93,8.26,4.1900000000000004,4.8600000000000003,9.0500000000000007,7.19,20.990000000000002]
[402.5,"75HP + 10 Bale Hay Forklift Grabber",3300,null,1.08,1.08,1.91,2.99,0.34,0.37,0.65,1.02,4.1900000000000004,1.9,6.09,2.91,11.17]
[403,"55HP + Bushhog Mounted 6FT",2439,null,1.1499999999999999,1.1499999999999999,2.15,3.3,0.34,0.39,0.73,1.1200000000000001,3.04,1.48,4.5199999999999996,2.37,8.9700000000000006]
[404,"75HP + Bushhog Pulled 10FT",9236.5,null,4.34,4.34,7.31,11.649999999999999,0.21,0.91,1.54,2.4500000000000002,2.59,1.85,4.4400000000000004,2.93,10.33]
[405,"120HP + Bushhog Winged 15FT",18054,null,8.48,8.48,14.02,22.5,0.14000000000000001,1.19,1.96,3.15,2.94,2.4300000000000002,5.37,3.59,12.57]
[406,"55HP + Farm Wagon",3000,null,2.94,2.94,4.5999999999999996,7.5399999999999991,0.02,0.06,0.09,0.15,0.25,0.15,0.4,0.23,0.74]
[407,"55HP + Farm Wagon in Field",3000,null,2.94,2.94,4.5999999999999996,7.5399999999999991,0.11,0.32,0.51,0.83000000000000007,1.36,0.81,2.17,1.24,4.08]
[408,"75HP + Rd Bale Silage Wrapper",21000,null,6.85,6.85,10.26,17.11,0.34,2.33,3.49,5.82,4.1900000000000004,3.86,8.0500000000000007,5.75,17.68]
[409,"55HP + Rd Bale Hay Wrapper ",12000,null,3.91,3.91,6.01,9.92,0.34,1.33,2.04,3.37,3.04,2.42,5.46,3.68,11.61]
[410,"75 MFWD + Front-end Loader",6960.5,null,3.49,3.49,5.09,8.58,0.83,2.9,4.22,7.1199999999999992,10.6,7.1,17.7,9.4700000000000006,34.11]
[410.5,"75MFWD+ Hay Grabber on Front-end Loader",4300,null,2.16,2.16,3.29,5.45,0.83,1.79,2.73,4.5199999999999996,10.6,6,16.600000000000001,7.98,31.5]
[411,"NURSE TANK ON PICK-UP",1650,null,1.51,1.51,2.06,3.5700000000000003,0.17,0.26,0.35,0.61,9.5299999999999994,4.09,13.62,6.6,16.240000000000002]
[412,"120MFWD + Liquid Fertilizer Injected",22500,null,22.02,22.02,32.19,54.209999999999994,0.17,3.74,5.47,9.2100000000000009,3.89,5.65,9.5399999999999991,7.61,19.34]
[413,"120MFWD + Dry Fertilizer Spreader, 5T",17500,null,17.12,17.12,25.12,42.24,0.04,0.68,1,1.6800000000000002,0.92,1.1299999999999999,2.0499999999999998,1.51,4.04]
[415,"75HP + Mech. Pkup Bale Wagon",18750,null,18.350000000000001,18.350000000000001,26.89,45.24,0.15,2.75,4.03,6.78,1.85,3.43,5.28,5.03,11.69]
[421,"55HP+Rotary Mower-5FT Mounted",4060.5,null,1.91,1.91,3.38,5.29,0.41,0.78,1.39,2.17,3.67,2.09,5.76,3.36,12.26]
[422,"75HP+Rotary Mower-10FT Pulled",6645,null,3.12,3.12,5.35,8.4699999999999989,0.21,0.66,1.1200000000000001,1.7800000000000002,2.59,1.6,4.1900000000000004,2.52,9.16]
[423,"120HP+Rotary Mower-15FT Foldup",18000,null,8.4499999999999993,8.4499999999999993,13.97,22.42,0.14000000000000001,1.18,1.96,3.1399999999999997,2.94,2.4300000000000002,5.37,3.58,12.55]
[431,"55HP + Trailer 4W",1900,null,1.86,1.86,3.04,4.9000000000000004,0.14000000000000001,0.26,0.43,0.69,1.25,0.71,1.96,1.1000000000000001,3.65]
[451.1,"55HP + Manure Spreader - 130 BU",11290.5,null,11.05,11.05,16.329999999999998,27.38,0.12,1.33,1.96,3.29,1.07,1.71,2.78,2.54,6.01]
[451.2,"75HP + Manure Spreader - 210 BU",14079.5,null,13.78,13.78,20.28,34.06,0.12,1.65,2.4300000000000002,4.08,1.48,2.19,3.67,3.23,7.84]
[451.3,"100HP + Manure Spreader-250 BU",18903,null,18.5,18.5,27.1,45.6,0.12,2.2200000000000002,3.25,5.4700000000000006,2.09,3.11,5.2,4.41,10.89]
[456,"100HP + Liquid Manure Spreader",20000,null,19.57,19.57,28.66,48.230000000000004,0.16,3.13,4.59,7.72,2.79,4.3099999999999996,7.1,6.13,14.969999999999999]
[457,"120MFWD + Liquid Manure Spreader Injected",40000,null,39.14,39.14,56.96,96.1,0.23,9,13.1,22.1,5.27,11.58,16.850000000000001,15.99,36.49]
[501,"Cotton Picker + 4 Row Hd",56000,null,11.22,11.22,20.399999999999999,31.619999999999997,0.39,4.38,7.96,12.34,64.790000000000006,44.1,108.89,70.349999999999994,187.82]
[502,"Cotton Picker + 6 Row Hd",84000,null,16.82,16.82,30.47,47.29,0.26,4.37,7.92,12.29,52.95,55.8,108.75,88.63,213.29]
[503,"Cotton Stripper + 6 Row Hd",64000,null,12.82,12.82,23.27,36.090000000000003,0.26,3.33,6.05,9.379999999999999,27.28,21.78,49.06,35.58,88.59]
[504,"145MFWD + Cotton Boll Buggy",28400,null,27,27,36.08,63.08,0.03,0.81,1.08,1.8900000000000001,0.85,1.23,2.08,1.56,31.21]
[505,"145MFWD + Cotton Module Builder",34500,null,10.43,10.43,15.83,26.259999999999998,0.11,1.1499999999999999,1.74,2.8899999999999997,3.1,2.7,5.8,3.47,10.940000000000001]
[507,"180MFWD + Cotton Bale Handler",29694,null,13.46,13.46,20.37,33.83,0.11,1.48,2.2400000000000002,3.72,3.13,3.41,6.54,4.24,12.07]
[511,"145MFWD + Digger Inverter 4R",25750,null,12.44,12.44,18.97,31.409999999999997,0.46,5.72,8.73,14.45,12.97,12.22,25.19,15.98,13.7]
[512,"145MFWD + Peanut Combine 4R",95062.5,null,44.24,44.24,73.569999999999993,117.81,0.46,20.350000000000001,33.840000000000003,54.190000000000005,12.97,26.85,39.82,41.09,42.57]
[513,"200MFWD + Peanut Combine 6R",123000,null,57.24,57.24,95.1,152.34,0.28999999999999998,16.600000000000001,27.58,44.18,12.57,24.27,36.840000000000003,35.49,85.12]
[514,"180MFWD + Peanut Planter 4R",36050,null,23.97,23.97,28.19,52.16,0.21,5.03,5.92,10.95,5.98,8.7200000000000006,14.7,9.74,84.45]
[521,"100MFWD + Potato Planter 2R",21000,null,20.37,20.37,21.27,41.64,0.41,8.35,8.7200000000000006,17.07,7.15,11.42,18.57,12.2,33.379999999999995]
[522,"120MFWD + Potato Planter 4R-36",43500,null,26.37,26.37,27.43,53.8,0.27,7.12,7.41,14.530000000000001,6.18,10.15,16.329999999999998,10.8,38.22]
[523,"145MFWD + Potato Planter 6R-36",63000,null,38.19,38.19,39.58,77.77,0.18,6.87,7.12,13.99,5.08,9.41,14.49,9.9600000000000009,48.339999999999996]
[524,"180MFWD + Potato Windrower 4R",64000,null,27.21,27.21,38.659999999999997,65.87,0.21,5.71,8.1199999999999992,13.829999999999998,5.98,9.4,15.38,11.94,57.570000000000007]
[525,"225MFWD + Potato Harvester 4R",119050,null,50.61,50.61,71.760000000000005,122.37,0.21,10.63,15.07,25.700000000000003,7.62,15.5,23.12,20.100000000000001,30.34]
[531,"75HP + Potato Planter 2R (Sweet)",6658.5,null,4.63,4.63,7.21,11.84,0.39,1.81,2.81,4.62,4.8,3.57,8.3699999999999992,5.41,46.36]
[532,"55MFWD + 1 Row Potato Digger ",9200,null,4.49,4.49,8.4,12.89,0.92,4.13,7.73,11.86,8.49,7.43,15.92,11.89,16.93]
[533,"145MFWD + Sweet Potato Harvester 2R",29500,null,14.39,14.39,26.18,40.57,0.46,6.62,12.04,18.66,13.1,14.69,27.79,20.41,33.49]
[599,"55HP + Mulch Lifter",2175,null,2.0699999999999998,2.0699999999999998,3.04,5.1099999999999994,0.34,0.7,1.03,1.73,3.04,1.79,4.83,2.67,60.81]
[599.5,"55HP + Mulch Wrapper",1037.5,null,0.99,0.99,1.62,2.6100000000000003,0.34,0.34,0.55000000000000004,0.89000000000000012,3.04,1.43,4.47,2.19,8.4]
[600,"55HP + Plastic Baler (Small)",6250,null,6.47,6.47,10.119999999999999,16.59,0.83,5.37,8.4,13.77,7.42,8.0299999999999994,15.45,12.4,7.7700000000000005]
[601,"55HP + Tobacco Baler (Small)",6250,null,6.47,6.47,10.119999999999999,16.59,0.83,5.37,8.4,13.77,7.42,8.0299999999999994,15.45,12.4,22.08]
[601.5,"75HP + Tobacco Baler (Large)",12500,null,8.6199999999999992,8.6199999999999992,13.38,22,0.83,7.15,11.11,18.259999999999998,10.23,10.89,21.12,16.62,22.08]
[602.20000000000005,"55HP + Rolling Cultivator 2-ROW",5410,null,1.69,1.69,3.03,4.72,0.36,0.61,1.0900000000000001,1.7000000000000002,3.22,1.76,4.9800000000000004,2.83,33.36]
[602.4,"75HP + Rolling Cultivator 4-ROW",10080,null,3.16,3.16,5.4,8.56,0.18,0.56999999999999995,0.97,1.54,2.2200000000000002,1.38,3.6,2.17,10.46]
[603,"75MFWD + Tobacco Harvester 1R",13125,null,5.69,5.69,11.24,16.93,2.95,16.79,33.159999999999997,49.949999999999996,37.67,31.74,69.41,51.8,7.6899999999999995]
[603.5,"75MFWD + BurleyTobacco Harvester 1R",66500,null,28.81,28.81,55.43,84.24,2.95,84.99,163.52000000000001,248.51,37.67,99.95,137.62,182.16,152.6]
[604,"HiBoy + Tobacco Topper 4-ROW",3250,null,3.11,3.11,6.21,9.32,0.06,0.19,0.37,0.56000000000000005,3.26,2.11,5.37,2.35,378.89]
[605,"35HP + Tobacco Trailer",1350,null,0.78,0.78,1.01,1.79,0.13,0.1,0.13,0.23,0.75,0.37,1.1200000000000001,0.56000000000000005,53.99]
[607.20000000000005,"55HP + Tobacco Transplanter 2R",5150,null,3.5,3.5,4.9000000000000004,8.4,0.77,2.7,3.77,6.4700000000000006,9.49,6.16,15.65,8.89,2.0099999999999998]
[607.4,"75HP + Tobacco Transplanter 4R",7850,null,4.21,4.21,5.81,10.02,0.38,1.6,2.21,3.81,4.68,3.31,7.99,4.7300000000000004,30.75]
[607.6,"75HP + Tobacco Transplanter 6R",8700,null,3.85,3.85,5.36,9.2100000000000009,0.26,1,1.39,2.3899999999999997,3.2,2.17,5.37,3.12,16.78]
[700,null,null,null,null,null,null,null,null,null,null,null,null,null,null,null,11.780000000000001]
[800]
[810]
[null,"Manual Input Here","Plastic","Tape","Total",null,null,null,"Hrs",null,null,null,"Fuel","Repairs",null,"FC"]
[]
[890.4,"Drip Irrigation (4FT Centers) Ac/In",337.59,246.84,584.42999999999995,null,null,null,1,null,null,null,13.99,1.6,null,164.55]
[890.5,"Drip Irrigation (5FT Centers) Ac/In",270.07,197.47,467.53999999999996,null,null,null,1,null,null,null,13.99,1.58,null,160.19999999999999]
[890.6,"Drip Irrigation (6FT Centers) Ac/In",225.06,164.56,389.62,null,null,null,1,null,null,null,13.99,1.56,null,157.29]
[890.8,"Drip Irrigation (8FT Centers) Ac/In",168.8,123.42,292.22000000000003,null,null,null,1,null,null,null,13.99,1.54,null,153.66]
[900,"Traveling Reel Gun",null,null,null,null,null,null,0.5,null,null,null,13.68,3.81,null,152.76]
[999]
[null,"Line 300 Last Piece of Equipment"]

{"sheet":"Seed","index":3,"n_rows":293,"n_cols":9,"rows_kept":293,"cut":false,"hidden":false,"merged":[]}
["ESTIMATED 2017/2018 PRICES FOR SEED, FERTILIZERS, AND LIME"]
["(USED IN PREPARING THE ENTERPRISE BUDGETS FOR 2018)"]
[null,null,null,"BUDGET",null,null,null,"PRICE FOR","Seed Count"]
["CODE","TYPE ","UNIT","UNIT","PRICE 1","PRICE 2","AVERAGE","BUDGET UNIT","Unit"]
[]
["ROW CROP SEED"]
[1,"  SEED: WHEAT","BAG","BAG",15,16.5,{"$f":"IF(E7=0,F7,IF(F7=0,E7,AVERAGE(E7,F7)))","v":15.75},{"$f":"ROUND(IF(C7=D7,G7,0),2)","v":15.75}]
[1.1000000000000001,"  WHEAT - Treated","BAG","BAG",19,24.5,21.75,21.75]
[1.2,"  WHEAT - Organic","BAG","BAG",26.5,null,26.5,26.5]
[1.3,"  WHEAT - Variety X","BAG","BAG",null,null,0,0]
[2,"  SEED: OATS","BAG","BAG",8.9600000000000009,12,10.48,10.48]
[3,"  SEED: BARLEY","BAG","BAG",11.5,14,12.75,12.75]
[3.5,"  SEED: BARLEY Thoroughbred","BAG","BAG",9,12.5,10.75,10.75]
[4,"  SEED: SOYBEANS","BAG","BAG",37,49,43,43]
[4.0999999999999996,"  SEED: SOYBEANS-eMerge","BAG","BAG",37.950000000000003,41.95,39.950000000000003,39.950000000000003]
[4.2,"  SEED: SOYBEANS-RR2","BAG","BAG",55,65,60,{"$f":"ROUND(IF(C16=D16,G16,0),2)","v":60},140000]
[4.3,"  SEED: SOYBEANS-RR2 treated","BAG","BAG",65,74,69.5,{"$f":"ROUND(IF(C17=D17,G17,0),2)","v":69.5},140000]
[4.5,"  SEED: SOYBEANS-LL","BAG","BAG",52,62,57,{"$f":"ROUND(IF(C18=D18,G18,0),2)","v":57}]
[4.5999999999999996,"  SEED: SOYBEANS-STS","BAG","BAG",39,52,{"$f":"IF(E19=0,F19,IF(F19=0,E19,AVERAGE(E19,F19)))","v":45.5},{"$f":"ROUND(IF(C19=D19,G19,0),2)","v":45.5}]
[4.7,"  SEED: Forage Soybeans","BAG","BAG",30,42,{"$f":"IF(E20=0,F20,IF(F20=0,E20,AVERAGE(E20,F20)))","v":36},{"$f":"ROUND(IF(C20=D20,G20,0),2)","v":36}]
[4.9000000000000004,"  SEED INNOCULANT","#/Seed","#/Seed",{"$f":"3/50","v":0.06},null,0.06,0.06]
[5,"  TOBACCO PLANTS - Burley","1M","1M",35,42,38.5,38.5]
[5.0999999999999996,"  TOBACCO PLANTS - Dark-fired","1M","1M",35,42,38.5,{"$f":"ROUND(IF(C23=D23,G23,0),2)","v":38.5}]
[5.2,"  TOBACCO PLANTS - Flue-cured","1M","1M",35,42,38.5,{"$f":"ROUND(IF(C24=D24,G24,0),2)","v":38.5}]
[5.3,"  TOBACCO PLANTS - Plantbed","1M","1M",25,35,30,30]
[5.6,"  TOBACCO - Burley","1M","1M",{"$f":"390/180","v":2.1666666666666665},{"$f":"410/180","v":2.2777777777777777},2.2222222222222223,2.2200000000000002]
[5.7,"  TOBACCO - Dark-fired","1M","1M",{"$f":"390/180","v":2.1666666666666665},{"$f":"410/180","v":2.2777777777777777},2.2222222222222223,2.2200000000000002]
[5.8,"  TOBACCO - Flue-cured","1M","1M",{"$f":"390/180","v":2.1666666666666665},{"$f":"410/180","v":2.2777777777777777},2.2222222222222223,2.2200000000000002]
[6,"  SEED: CORN","BAG","BAG",156,226,191,{"$f":"ROUND(IF(C29=D29,G29,0),3)","v":191},80000]
[6.11,"  SEED: CORN Smart Stax","BAG","BAG",288,310,299,{"$f":"ROUND(IF(C30=D30,G30,0),3)","v":299}]
[6.11,"  SEED: CORN VT3 PRO","BAG","BAG",275,300,287.5,{"$f":"ROUND(IF(C31=D31,G31,0),3)","v":287.5}]
[6.12,"  SEED: CORN VT2 PRO","BAG","BAG",230,250,240,240]
[6.13,"  SEED: CORN BT-RW","BAG","BAG",134,200,167,167]
[6.14,"  SEED: CORN BT-RR2","BAG","BAG",165,185,175,175]
[6.15,"  SEED: CORN BT","BAG","BAG",140,165,152.5,152.5]
[6.21,"  SEED: Corn BMR Stacked","BAG","BAG",245,300,272.5,272.5]
[6.22,"  SEED: CORN RR2","BAG","BAG",185,245,215,215]
[6.41,"  SEED: CORN-RW","BAG","BAG",205,215,{"$f":"IF(E38=0,F38,IF(F38=0,E38,AVERAGE(E38,F38)))","v":210},210]
[6.5,"  SEED: CORN Organic","BAG","BAG",129,159,{"$f":"IF(E39=0,F39,IF(F39=0,E39,AVERAGE(E39,F39)))","v":144},144]
[6.5125000000000002,"  SEED: CORN Poncho 1250","BAG","BAG",190,244,217,217]
[6.6,"  SEED: CORN HX+LL","BAG","BAG",176,180,178,{"$f":"ROUND(IF(C41=D41,G41,0),3)","v":178}]
[6.61,"  SEED: CORN HI+LL","BAG","BAG",212,220,216,{"$f":"ROUND(IF(C42=D42,G42,0),3)","v":216}]
[6.62,"  SEED: CORN HRW+LL","BAG","BAG",236,280,258,{"$f":"ROUND(IF(C43=D43,G43,0),3)","v":258}]
[6.8,"  SEED: CORN eMerge","BAG","BAG",175,185,180,{"$f":"ROUND(IF(C44=D44,G44,0),3)","v":180}]
[7,"  SEED: COTTON Conventional","BAG","BAG",152.5,184.95,168.72499999999999,{"$f":"ROUND(IF(C45=D45,G45,0),2)","v":168.73},250000]
[7.1,"  SEED: COTTON-RR Flex","BAG","BAG",{"$f":"(E$45*($I46/$I$45))+264.2","v":404.5},{"$f":"(F$45*($I46/$I$45))+264.2","v":434.35399999999998},419.42700000000002,419.43,230000]
[7.2,"  SEED: COTTON-B2","BAG","BAG",{"$f":"(E$45*($I47/$I$45))+193","v":333.3},{"$f":"(F$45*($I47/$I$45))+193","v":363.154},348.22699999999998,348.23,230000]
[7.3,"  SEED: COTTON-B2RF","BAG","BAG",{"$f":"(E$45*($I48/$I$45))+379.2","v":519.5},{"$f":"(F$45*($I48/$I$45))+379.2","v":549.35400000000004},534.42700000000002,534.42999999999995,230000]
[7.5,"  SEED: COTTON-WRF","BAG","BAG",{"$f":"(E$45*($I49/$I$45))+(94+265)","v":499.3},{"$f":"(F$45*($I49/$I$45))+(94+255)","v":519.154},509.22699999999998,509.23,230000]
[7.6,"  SEED: COTTON-LLB2","BAG","BAG",{"$f":"(E$45*($I50/$I$45))+(100+184.6)","v":418.8},{"$f":"(F$45*($I50/$I$45))+(100+184.6)","v":447.35599999999999},433.07799999999997,433.08,220000]
[7.7,"  SEED: COTTON-GLT","BAG","BAG",277.5,287.5,{"$f":"IF(E51=0,F51,IF(F51=0,E51,AVERAGE(E51,F51)))","v":282.5},{"$f":"ROUND(IF(C51=D51,G51,0),2)","v":282.5},220000]
[7.8,"  SEED: COTTON-GLB2","BAG","BAG",{"$f":"(E$45*($I52/$I$45))+(90+184.6)","v":408.8},{"$f":"(F$45*($I52/$I$45))+(90+184.6)","v":437.35599999999999},{"$f":"IF(E52=0,F52,IF(F52=0,E52,AVERAGE(E52,F52)))","v":423.07799999999997},{"$f":"ROUND(IF(C52=D52,G52,0),2)","v":423.08},220000]
[7.9,"  SEED: COTTON-Enlist","BAG","BAG",null,null,{"$f":"IF(E53=0,F53,IF(F53=0,E53,AVERAGE(E53,F53)))","v":0},{"$f":"ROUND(IF(C53=D53,G53,0),2)","v":0}]
[8,"  SEED: PEANUTS Virginia","LBS","LBS",0.8,0.84,0.82000000000000006,0.82]
[8.5,"  SEED: PEANUTS Runner","LBS","LBS",0.78,0.82,0.8,0.8]
[9,"  SEED: SUNFLOWER","LBS","LBS",{"$f":"29.99/50","v":0.5998},{"$f":"41.99/50","v":0.83979999999999999},0.7198,0.72]
[10,"  SEED: GRAIN SORGHUM","LBS","LBS",2.5,{"$f":"140/50","v":2.8},2.65,2.65]
[11,"  SEED: CANOLA (RR Higher)","LBS","LBS",2.5,4.5,3.5,3.5]
["FORAGE SEED"]
[100.1,"  SEED Innoculant: Alfalfa","#/Seed","#/Seed",{"$f":"11.99/50","v":0.23980000000000001},3.86,{"$f":"IF(E60=0,F60,IF(F60=0,E60,AVERAGE(E60,F60)))","v":2.0499000000000001},{"$f":"ROUND(IF(C60=D60,G60,0),2)","v":2.0499999999999998}]
[100.2,"  SEED Innoculant: Clover","#/Seed","#/Seed",{"$f":"11.99/50","v":0.23980000000000001},3.86,{"$f":"IF(E61=0,F61,IF(F61=0,E61,AVERAGE(E61,F61)))","v":2.0499000000000001},2.0499999999999998]
[100.5,"  SEED Innoculant: Soybeans","Unit","Unit",3.5,3.8,{"$f":"IF(E62=0,F62,IF(F62=0,E62,AVERAGE(E62,F62)))","v":3.65},3.65]
[101,"  SEED: ALFALFA","LBS","LBS",3.55,4.9800000000000004,{"$f":"IF(E63=0,F63,IF(F63=0,E63,AVERAGE(E63,F63)))","v":4.2650000000000006},4.2699999999999996]
[101.1,"  SEED: ALFALFA grazing varieties","LBS","LBS",{"$f":"259/50","v":5.18},{"$f":"295/50","v":5.9},{"$f":"IF(E64=0,F64,IF(F64=0,E64,AVERAGE(E64,F64)))","v":5.54},{"$f":"ROUND(IF(C64=D64,G64,0),2)","v":5.54}]
[101.5,"  SEED: ALFALFA RR","LBS","LBS",{"$f":"485/50","v":9.6999999999999993},{"$f":"555/50","v":11.1},{"$f":"IF(E65=0,F65,IF(F65=0,E65,AVERAGE(E65,F65)))","v":10.399999999999999},10.4]
[102.9,"  SEED: ALFALFA - Organic","LBS","LBS",{"$f":"237/50","v":4.74},5,4.87,4.87]
[103,"  SEED: Austrian Winter Pea","LBS","LBS",0.73,0.85,0.79,0.79]
[104,"  SEED: Bentgrass - Creeping","LBS","LBS",{"$f":"253/25","v":10.119999999999999},{"$f":"306/25","v":12.24},11.18,{"$f":"ROUND(IF(C68=D68,G68,0),3)","v":11.18}]
[105,"  SEED: Bermudagrass","LBS","LBS",5,8.6,6.8,6.8]
[106,"  Bermudagrass Sprigs","each","each",null,{"$f":"39.99/36","v":1.1108333333333333},1.1108333333333333,1.111]
[107,"  SEED: Birdsfoot Trefoil","LBS","LBS",{"$f":"315/50","v":6.3},{"$f":"499/50","v":9.98},8.14,8.14]
[108,"  SEED: Bluegrass - Kentucky","LBS","LBS",{"$f":"130/50","v":2.6},{"$f":"189.99/50","v":3.7998000000000003},3.1999000000000004,3.2]
[109,"  SEED: Bromegrass - Smooth","LBS","LBS",{"$f":"269/50","v":5.38},{"$f":"339/50","v":6.78},6.08,6.08]
[110,"  SEED: Buckwheat","LBS","LBS",{"$f":"48.99/50","v":0.9798},{"$f":"54.99/50","v":1.0998000000000001},1.0398000000000001,1.04]
[111,"  SEED: Caucasian Bluestem","LBS PLS","LBS PLS",{"$f":"455/25","v":18.2},{"$f":"500/25","v":20},19.100000000000001,19.100000000000001]
[112,"  SEED: CLOVER - Alsike","LBS","LBS",3.86,3.9,3.88,{"$f":"ROUND(IF(C76=D76,G76,0),2)","v":3.88}]
[113,"  SEED: CLOVER - Crimson","LBS","LBS",1.8,null,1.8,{"$f":"ROUND(IF(C77=D77,G77,0),2)","v":1.8}]
[114,"  SEED: CLOVER - Ladino","LBS","LBS",{"$f":"180/50","v":3.6},{"$f":"205/50","v":4.0999999999999996},{"$f":"IF(E78=0,F78,IF(F78=0,E78,AVERAGE(E78,F78)))","v":3.8499999999999996},{"$f":"ROUND(IF(C78=D78,G78,0),2)","v":3.85}]
[115,"  SEED: CLOVER - Red","LBS","LBS",1.8,2.98,2.39,{"$f":"ROUND(IF(C79=D79,G79,0),2)","v":2.39}]
[116,"  SEED: CLOVER - Sweet","LBS","LBS",{"$f":"130/50","v":2.6},{"$f":"150/50","v":3},2.8,{"$f":"ROUND(IF(C80=D80,G80,0),2)","v":2.8}]
[117,"  SEED: Comfrey, Quaker","LBS","LBS",null,null,0,{"$f":"ROUND(IF(C81=D81,G81,0),3)","v":0}]
[118,"  SEED: Crabgrass","LBS PLS","LBS PLS",{"$f":"560/50","v":11.2},{"$f":"569/50","v":11.38},11.29,{"$f":"ROUND(IF(C82=D82,G82,0),3)","v":11.29}]
[119,"  SEED: Crownvetch","LBS","LBS",1.9,2.38,2.1399999999999997,{"$f":"ROUND(IF(C83=D83,G83,0),3)","v":2.14}]
[120,"  SEED: Eastern Gamagrass","LBS PLS","LBS PLS",0.5,null,0.5,{"$f":"ROUND(IF(C84=D84,G84,0),3)","v":0.5}]
[121,"  SEED: FESCUE - Endophyte Free","LBS","LBS",1.24,1.35,1.2949999999999999,{"$f":"ROUND(IF(C85=D85,G85,0),2)","v":1.3}]
[122,"  SEED: FESCUE - Friendly Endophyte","LBS","LBS",3.5,3.76,3.63,{"$f":"ROUND(IF(C86=D86,G86,0),2)","v":3.63}]
[123,"  SEED: FESCUE - KY31","LBS","LBS",{"$f":"59/50","v":1.18},1.1000000000000001,1.1400000000000001,{"$f":"ROUND(IF(C87=D87,G87,0),2)","v":1.1399999999999999}]
[124,"  SEED: Lab Lab Bean","LBS","LBS",{"$f":"155/55","v":2.8181818181818183},null,2.8181818181818183,{"$f":"ROUND(IF(C88=D88,G88,0),3)","v":2.8180000000000001}]
[125,"  SEED: Lespedeza - Annual","LBS","LBS",{"$f":"280/50","v":5.6},{"$f":"315/50","v":6.3},5.9499999999999993,{"$f":"ROUND(IF(C89=D89,G89,0),3)","v":5.95}]
[125.5,"  SEED: Lespedeza - Bicolor","LBS","LBS",{"$f":"300/50","v":6},{"$f":"350/50","v":7},6.5,{"$f":"ROUND(IF(C90=D90,G90,0),3)","v":6.5}]
[126,"  SEED: Lespedeza - Sericea","LBS","LBS",{"$f":"169/50","v":3.38},{"$f":"275/50","v":5.5},4.4399999999999995,{"$f":"ROUND(IF(C91=D91,G91,0),3)","v":4.4400000000000004}]
[127,"  SEED: Matua Prairie Grass","LBS","LBS",2.16,2.35,2.2549999999999999,{"$f":"ROUND(IF(C92=D92,G92,0),3)","v":2.2549999999999999}]
[128,"  SEED: Millet - Foxtail","LBS","LBS",{"$f":"55/50","v":1.1000000000000001},null,1.1000000000000001,{"$f":"ROUND(IF(C93=D93,G93,0),2)","v":1.1000000000000001}]
[128.5,"  SEED: Millet - Pearl","LBS","LBS",{"$f":"74.99/50","v":1.4997999999999998},{"$f":"74.99/50","v":1.4997999999999998},1.4997999999999998,{"$f":"ROUND(IF(C94=D94,G94,0),2)","v":1.5}]
[129,"  SEED: Orchardgrass","LBS","LBS",2.15,3,2.5750000000000002,{"$f":"ROUND(IF(C95=D95,G95,0),2)","v":2.58},"Potomac"]
[130,"  SEED: Rape","LBS","LBS",{"$f":"49.99/50","v":0.99980000000000002},{"$f":"56.99/50","v":1.1398000000000001},1.0698000000000001,{"$f":"ROUND(IF(C96=D96,G96,0),3)","v":1.07}]
[131,"  SEED: Redtop (Herdsgrass)","LBS","LBS",7.35,8.4600000000000009,7.9050000000000002,7.9050000000000002]
[132,"  SEED: Reed Canarygrass","LBS","LBS",{"$f":"700/50","v":14},null,14,14]
[133,"  SEED: RYE","BU.","BU.",32,37,34.5,34.5]
[133.5,"  SEED: RYE Cover crop","LBS","LBS",0.33,{"$f":"18.99/50","v":0.37979999999999997},0.35489999999999999,0.35499999999999998]
[134,"  SEED: RYEGRASS (Annual)","LBS","LBS",0.6,{"$f":"35/50","v":0.7},0.64999999999999991,0.65]
[134.5,"  SEED: RYEGRASS (Perennial)","LBS","LBS",1.3,null,1.3,1.3]
[135,"  SEED: Sorghum - BMR forage","LBS","LBS",1.2,1.66,{"$f":"IF(E103=0,F103,IF(F103=0,E103,AVERAGE(E103,F103)))","v":1.43},{"$f":"ROUND(IF(C103=D103,G103,0),2)","v":1.43}]
[136,"  SEED: Sorghum - sweet","LBS","LBS",7.5,9.5,{"$f":"IF(E104=0,F104,IF(F104=0,E104,AVERAGE(E104,F104)))","v":8.5},{"$f":"ROUND(IF(C104=D104,G104,0),2)","v":8.5}]
[137,"  SEED: Sorghum / Sudangrass","LBS","LBS",{"$f":"99/50","v":1.98},null,{"$f":"IF(E105=0,F105,IF(F105=0,E105,AVERAGE(E105,F105)))","v":1.98},{"$f":"ROUND(IF(C105=D105,G105,0),2)","v":1.98}]
[138,"  SEED: Sudangrass","LBS","LBS",{"$f":"72/50","v":1.44},1.5,1.47,{"$f":"ROUND(IF(C106=D106,G106,0),3)","v":1.47}]
[139,"  SEED: Sugar Beets - Biennial","LBS","LBS",{"$f":"235/50","v":4.7},{"$f":"260/50","v":5.2},4.95,4.95]
[140,"  SEED: Switchgrass","LBS PLS","LBS PLS",null,{"$f":"69.99/5","v":13.997999999999999},13.997999999999999,13.997999999999999]
[140.5,"  SEED: Tall Meadow Oatgrass","LBS","LBS",4.4000000000000004,8,6.2,6.2]
[141,"  SEED: Teff","LBS","LBS",{"$f":"169/50","v":3.38},{"$f":"199/50","v":3.98},{"$f":"IF(E110=0,F110,IF(F110=0,E110,AVERAGE(E110,F110)))","v":3.6799999999999997},{"$f":"ROUND(IF(C110=D110,G110,0),3)","v":3.68}]
[142,"  SEED: Timothy","LBS","LBS",{"$f":"89.99/50","v":1.7997999999999998},{"$f":"125.99/50","v":2.5198},2.1597999999999997,2.16]
[142.1,"  SEED: Timothy Organic","LBS","LBS",1.88,2.5299999999999998,{"$f":"IF(E112=0,F112,IF(F112=0,E112,AVERAGE(E112,F112)))","v":2.2050000000000001},{"$f":"ROUND(IF(C112=D112,G112,0),3)","v":2.2050000000000001}]
[142.5,"  SEED: Tritacal","LBS","LBS",0.31,0.35,{"$f":"IF(E113=0,F113,IF(F113=0,E113,AVERAGE(E113,F113)))","v":0.32999999999999996},{"$f":"ROUND(IF(C113=D113,G113,0),3)","v":0.33}]
[143,"  SEED: Weping Lovegrass","LBS","LBS",{"$f":"310/50","v":6.2},null,6.2,6.2]
[144,"  SEED: White Clover - Common","LBS","LBS",2.2999999999999998,{"$f":"170/50","v":3.4},{"$f":"IF(E115=0,F115,IF(F115=0,E115,AVERAGE(E115,F115)))","v":2.8499999999999996},{"$f":"ROUND(IF(C115=D115,G115,0),3)","v":2.85}]
[145,"  SEED: White Clover - Ladino","LBS","LBS",2.7,{"$f":"259/50","v":5.18},{"$f":"IF(E116=0,F116,IF(F116=0,E116,AVERAGE(E116,F116)))","v":3.94},3.94]
[150,"  SEED: Forage Radish","LBS","LBS",1.33,1.98,{"$f":"IF(E117=0,F117,IF(F117=0,E117,AVERAGE(E117,F117)))","v":1.655},{"$f":"ROUND(IF(C117=D117,G117,0),3)","v":1.655}]
["VEGETABLE & FRUIT SEED"]
[200,"  SEED: (Not Included)","1M","1M",null,null,{"$f":"IF(E119=0,F119,IF(F119=0,E119,AVERAGE(E119,F119)))","v":0},{"$f":"ROUND(IF(C119=D119,G119,0),2)","v":0}]
[201,"  Asparagus Crowns","1M","1M",60.9,76.599999999999994,{"$f":"IF(E120=0,F120,IF(F120=0,E120,AVERAGE(E120,F120)))","v":68.75},{"$f":"ROUND(IF(C120=D120,G120,0),2)","v":68.75}]
[203,"  SEED: BROCCOLI","LBS","LBS",34,230,{"$f":"IF(E121=0,F121,IF(F121=0,E121,AVERAGE(E121,F121)))","v":132},{"$f":"ROUND(IF(C121=D121,G121,0),2)","v":132}]
[204,"  SEED: BROCCOLI","1M","1M",2.5,4.45,3.4750000000000001,3.48]
[205,"  SEED: CABBAGE - Fresh Market","1M","1M",3.45,5.15,4.3000000000000007,4.3]
[206,"  SEED: CABBAGE - Storage","1M","1M",7.35,8.35,7.85,7.85]
[210,"  SEED: Carrots","LBS","LBS",10.7,null,10.7,10.7]
[211,"  SEED: Carrots","1M","1M",0.37,0.71,0.54,0.54]
[215,"  SEED: Cauliflower","1M","1M",4.8499999999999996,26.7,15.774999999999999,15.78]
[218,"  SEED: Collards","LBS","LBS",12.15,null,12.15,12.15]
[220,"  SEED: Pickling Cucumber","1M","1M",2.9,7.25,5.0750000000000002,5.08]
[221,"  SEED: Cucumber","1M","1M",5.4,18.5,11.95,11.95]
[225,"  SEED: Eggplant","1M","1M",6.3,13.55,9.9250000000000007,9.93]
[226,"  SEED: Gourds","LBS","LBS",47.3,72.5,59.9,59.9]
[227,"  SEED: Green Beans","LBS","LBS",1.65,2.5,2.0750000000000002,2.08]
[228,"  SEED: Green Beans","1M","1M",1.8,2.65,2.2250000000000001,2.23]
[229,"  SEED: Kale","1M","1M",4.3,9.1999999999999993,6.75,6.75]
[230,"  SEED: Lima Beans","LBS","LBS",1.3,2.25,1.7749999999999999,1.78]
[231,"  SEED: MELONS Canteloupes","1M","1M",34.9,40.950000000000003,37.924999999999997,37.93]
[232,"  SEED: MELONS Honeydew","1M","1M",24.05,25.2,24.625,24.63]
[233,"  SEED: MELONS Speciality","1M","1M",30.05,42.65,36.35,36.35]
[235,"  SEED: Okra","LBS","LBS",140,155,147.5,147.5]
[236,"  SEED: Onions Bunching","LBS","LBS",16.5,50,33.25,33.25]
[237,"  SEED: Onions Yellow","1M","1M",1.35,1.65,1.5,1.5]
[238,"  SEED: Peas ","LBS","LBS",1.5,2.4,1.95,1.95]
[239,"  SEED: Peas Edible Pod","LBS","LBS",1.95,2.95,2.4500000000000002,2.4500000000000002]
[241,"  SEED: PEPPERS","1M","1M",32,53.8,{"$f":"IF(E145=0,F145,IF(F145=0,E145,AVERAGE(E145,F145)))","v":42.9},{"$f":"ROUND(IF(C145=D145,G145,0),2)","v":42.9}]
[241.2,"  SEED: PEPPERS, Colored Bell","1M","1M",29.4,65.5,47.45,47.45]
[241.4,"  SEED: PEPPERS, Jalapeno","1M","1M",27.3,42,34.65,34.65]
[241.6,"  SEED: PEPPERS, Other Hot","1M","1M",25.75,42.05,33.9,33.9]
[241.8,"  SEED: PEPPERS, Sweet Bell","1M","1M",32,53.8,42.9,42.9]
[242,"  SEED: PEPPERS, Sweet Speciality","1M","1M",23.65,48.5,36.075000000000003,36.08]
[243,"  SEED: POPCORN","LBS","LBS",6.35,22,{"$f":"IF(E151=0,F151,IF(F151=0,E151,AVERAGE(E151,F151)))","v":14.175000000000001},{"$f":"ROUND(IF(C151=D151,G151,0),2)","v":14.18}]
[245,"  SEED: POTATOES","CWT","CWT",15,24,19.5,19.5]
[245.5,"  SEED: POTATOES Minitubers","CWT","CWT",20,27,{"$f":"IF(E153=0,F153,IF(F153=0,E153,AVERAGE(E153,F153)))","v":23.5},{"$f":"ROUND(IF(C153=D153,G153,0),2)","v":23.5}]
[247,"  SEED: Pumpkins","LBS","LBS",19.7,99.25,59.475000000000001,59.48]
[248,"  SEED: Pumpkins","1M","1M",20.3,47.05,33.674999999999997,33.68]
[249,"  SEED: Spinach","1M","1M",0.25,0.41,0.32999999999999996,0.33]
[251,"  SEED: SQUASH, Summer Other","1M","1M",20.6,24,22.3,22.3]
[252,"  SEED: SQUASH, Summer Yellow","1M","1M",15.3,38.450000000000003,26.875,26.88]
[253,"  SEED: SQUASH, Summer Zucchini","1M","1M",26.45,36.549999999999997,31.5,31.5]
[260,"  SEED: Sweet Corn ","1M","1M",7,8.25,{"$f":"IF(E160=0,F160,IF(F160=0,E160,AVERAGE(E160,F160)))","v":7.625},{"$f":"ROUND(IF(C160=D160,G160,0),2)","v":7.63}]
[261.10000000000002,"  SEED: Sweet Corn Bi-color se","1M","1M",7,8.25,7.625,7.63]
[261.2,"  SEED: Sweet Corn Bi-color sh2","1M","1M",3.95,5.75,4.8499999999999996,4.8499999999999996]
[261.3,"  SEED: Sweet Corn Bi-color su","LBS","LBS",6.05,6.25,6.15,6.15]
[262.10000000000002,"  SEED: Sweet Corn Synergistic Bi-color","1M","1M",3.7,6.25,4.9749999999999996,4.9800000000000004]
[262.2,"  SEED: Sweet Corn Synergistic Yellow","1M","1M",3.25,4.4000000000000004,3.8250000000000002,3.83]
[263.10000000000002,"  SEED: Sweet Corn white se","1M","1M",3.75,4.5,4.125,4.13]
[263.2,"  SEED: Sweet Corn white sh2","1M","1M",3.9,5.5,4.7,4.7]
[263.3,"  SEED: Sweet Corn white su","LBS","LBS",6.1,6.75,6.4249999999999998,6.43]
[264.10000000000002,"  SEED: Sweet Corn Yellow se","1M","1M",6.2,8,7.1,7.1]
[264.2,"  SEED: Sweet Corn Yellow sh2","1M","1M",3.65,5.3,4.4749999999999996,4.4800000000000004]
[264.3,"  SEED: Sweet Corn Yellow su","LBS","LBS",6.1,8.3000000000000007,7.2,7.2]
[271,"  SEED: TOMATO","1M","1M",20.9,49.65,35.274999999999999,35.28]
[272,"  SEED: TOMATO Cherry & Grape","1M","1M",21.15,75.7,48.424999999999997,48.43]
[273,"  SEED: TOMATO Roma","1M","1M",21.35,53.75,37.549999999999997,37.549999999999997]
[273,"  SEED: TOMATO Hydroponics","1M","1M",325,400,{"$f":"IF(E175=0,F175,IF(F175=0,E175,AVERAGE(E175,F175)))","v":362.5},{"$f":"ROUND(IF(C175=D175,G175,0),2)","v":362.5}]
[275,"  SEED: Watermelons Pollinators","1M","1M",82,114,98,98]
[276,"  SEED: Watermelons Seeded","1M","1M",30.45,55.75,43.1,43.1]
[277,"  SEED: Watermelons Seeded","LBS","LBS",22,50,36,36]
[278,"  SEED: Watermelons Seedless","1M","1M",149,211,180,180]
[280,"  SEED Innoculant: Peas & Beans","LBS","LBS",6.99,11.99,9.49,9.49]
[]
["VEGETABLE & FRUIT TRANSPLANTS"]
[300,"  Plant Plugs: (Seed Not Included) ","1M","1M",null,null,{"$f":"IF(E183=0,F183,IF(F183=0,E183,AVERAGE(E183,F183)))","v":0},{"$f":"ROUND(IF(C183=D183,G183,0),2)","v":0}]
[301,"  CROWNS: Asparagus","1M","1M",176,200,{"$f":"IF(E184=0,F184,IF(F184=0,E184,AVERAGE(E184,F184)))","v":188},{"$f":"ROUND(IF(C184=D184,G184,0),2)","v":188}]
[303,"  PLANTS: Broccoli - Fall Plantbed","1M","1M",53.47,106.94,80.204999999999998,80.209999999999994]
[304,"  PLANTS: Broccoli - Spring Greenhouse","1M","1M",100.17,159.6,129.88499999999999,129.88999999999999]
[305,"  PLANTS: Cabbage - Fall Plantbed","1M","1M",54.38,108.76,81.570000000000007,81.569999999999993]
[306,"  PLANTS: Cabbage - Spring","1M","1M",101.08,159.6,130.34,130.34]
[320,"  PLANTS: Cucumber - Slicing","1M","1M",138.44999999999999,154.13999999999999,146.29499999999999,146.30000000000001]
[321,"  PLANTS: Cucumber - Pickling","1M","1M",138.44999999999999,169.4,153.92500000000001,153.93]
[325,"  PLANTS: Eggplant","1M","1M",126.17,245.28,185.72499999999999,185.73]
[331,"  PLANTS: Melons-W.Canteloupe","1M","1M",138.44999999999999,192.85,165.64999999999998,165.65]
[332,"  PLANTS: Melons-Honeydew","1M","1M",138.44999999999999,246.05,192.25,192.25]
[333,"  PLANTS: Melons-Speciality","1M","1M",138.44999999999999,246.05,192.25,192.25]
[334,"  PLANTS: Melons-E.Canteloupe","1M","1M",138.44999999999999,192.85,165.64999999999998,165.65]
[336,"  PLANTS: Green Onions","1M","1M",null,null,0,0]
[341.6,"  PLANTS: Peppers Hot","1M","1M",126.17,152.94999999999999,139.56,139.56]
[341.8,"  PLANTS: Peppers Sweet Bell","1M","1M",126.17,226.1,176.13499999999999,176.14]
[342,"  PLANTS: Peppers Speciality","1M","1M",126.17,279.3,202.73500000000001,202.74]
[351,"  PLANTS: SQUASH, Other Summer","1M","1M",131.30000000000001,152.94999999999999,142.125,142.13]
[352,"  PLANTS: SQUASH, Yellow","1M","1M",131.30000000000001,159.6,145.44999999999999,145.44999999999999]
[353,"  PLANTS: SQUASH, Zucchini","1M","1M",176.18,192.85,184.51499999999999,184.52]
[355,"  PLANTS: Strawberry","1M","1M",254,294,274,274]
[358,"  PLANTS: Sweet Potato Slips","1M","1M",33,37,35,35]
[371,"  PLANTS: Tomatoes","1M","1M",110.63,221.26,165.94499999999999,165.95]
[371.5,"  PLANTS: Tomatoes Heirloom","1M","1M",252.7,null,252.7,252.7]
[372,"  PLANTS: Tomatoes Cherry/Grape","1M","1M",452.2,null,452.2,452.2]
[373,"  PLANTS: Tomatoes Roma","1M","1M",125.24,250.48,187.85999999999999,187.86]
[376,"  PLANTS: Watermelon-Seeded","1M","1M",219.09,139.65,179.37,{"$f":"ROUND(IF(C209=D209,G209,0),3)","v":179.37}]
[378,"  PLANTS: Watermelon-Seedless","1M","1M",296.3,542.86,419.58000000000004,{"$f":"ROUND(IF(C210=D210,G210,0),3)","v":419.58}]
[400.072,"  CUSTOM Transplants 72 Count","1M","1M",236.22,null,{"$f":"IF(E211=0,F211,IF(F211=0,E211,AVERAGE(E211,F211)))","v":236.22},{"$f":"ROUND(IF(C211=D211,G211,0),3)","v":236.22}]
[400.12799999999999,"  CUSTOM Transplants 128 Count","1M","1M",113.1,153,{"$f":"IF(E212=0,F212,IF(F212=0,E212,AVERAGE(E212,F212)))","v":133.05000000000001},{"$f":"ROUND(IF(C212=D212,G212,0),3)","v":133.05000000000001}]
[400.25599999999997,"  CUSTOM Transplants 256 Count","1M","1M",85.04,null,{"$f":"IF(E213=0,F213,IF(F213=0,E213,AVERAGE(E213,F213)))","v":85.04},{"$f":"ROUND(IF(C213=D213,G213,0),3)","v":85.04}]
["FERTILIZER & LIME"]
[499,"  Fertilizer Blend"]
[500,"  Fertilizer Application","ACRE","ACRE",7,7.5,{"$f":"IF(E216=0,F216,IF(F216=0,E216,AVERAGE(E216,F216)))","v":7.25},{"$f":"ROUND(IF(C216=\"TON\",IF(D216=\"CWT\",G216/20,IF(D216=\"LBS\",G216/2000,IF(D216=\"GAL\",(G216/2000)*11.5,G216))),G216),2)","v":7.25}]
[500.5,"  Manure Application","ACRE","ACRE",7,7,{"$f":"IF(E217=0,F217,IF(F217=0,E217,AVERAGE(E217,F217)))","v":7},{"$f":"ROUND(IF(C217=\"TON\",IF(D217=\"CWT\",G217/20,IF(D217=\"LBS\",G217/2000,IF(D217=\"GAL\",(G217/2000)*11.5,G217))),G217),2)","v":7}]
[501,"  30% Nitrogen Solution","LBS","LBS",0.35,0.49,{"$f":"IF(E218=0,F218,IF(F218=0,E218,AVERAGE(E218,F218)))","v":0.42},{"$f":"ROUND(IF(C218=\"TON\",IF(D218=\"CWT\",G218/20,IF(D218=\"LBS\",G218/(0.3*2000),IF(D218=\"GAL\",(G218/(0.3*2000))*11.5,G218))),G218),2)","v":0.42},225]
[501.5,"  30% Nitrogen Solution Spread","LBS","LBS",0.42,0.56000000000000005,0.49,{"$f":"ROUND(IF(C219=\"TON\",IF(D219=\"CWT\",G219/20,IF(D219=\"LBS\",G219/(0.3*2000),IF(D219=\"GAL\",(G219/(0.3*2000))*11.5,G219))),G219),2)","v":0.49}]
[502,"  34% Ammonium Nitrate","TON","CWT",null,null,{"$f":"IF(E220=0,F220,IF(F220=0,E220,AVERAGE(E220,F220)))","v":0},{"$f":"ROUND(IF(C220=\"TON\",IF(D220=\"CWT\",G220/20,IF(D220=\"LBS\",G220/(0.3*2000),IF(D220=\"GAL\",(G220/(0.3*2000))*11.5,G220))),G220),2)","v":0}]
[503,"  21% Ammonium Sulphate","TON","CWT",333,374,353.5,{"$f":"ROUND(IF(C221=\"TON\",IF(D221=\"CWT\",G221/20,IF(D221=\"LBS\",G221/(1*2000),IF(D221=\"GAL\",(G221/(1*2000))*11.5,G221))),G221),2)","v":17.68}]
[504,"  Nitrogen","LBS","LBS",0.52,0.52,0.52,{"$f":"ROUND(IF(C222=\"TON\",IF(D222=\"CWT\",G222/20,IF(D222=\"LBS\",G222/(0.335*2000),IF(D222=\"GAL\",(G222/(0.335*2000))*11.5,G222))),G222),2)","v":0.52}]
[504.1,"  Nitrogen fixed from atmosphere","LBS","LBS",0,0,{"$f":"IF(E223=0,F223,IF(F223=0,E223,AVERAGE(E223,F223)))","v":0},{"$f":"ROUND(IF(C223=\"TON\",IF(D223=\"CWT\",G223/20,IF(D223=\"LBS\",G223/(0.335*2000),IF(D223=\"GAL\",(G223/(0.335*2000))*11.5,G223))),G223),2)","v":0}]
[504.5,"  Nitrogen seVA","LBS","LBS",0.33,0.47,{"$f":"IF(E224=0,F224,IF(F224=0,E224,AVERAGE(E224,F224)))","v":0.4},{"$f":"ROUND(IF(C224=\"TON\",IF(D224=\"CWT\",G224/20,IF(D224=\"LBS\",G224/(0.335*2000),IF(D224=\"GAL\",(G224/(0.335*2000))*11.5,G224))),G224),2)","v":0.4}]
[504.9,"  Nitrogen + Nutrisphere","LBS","LBS",{"$f":"E224+0.07","v":0.4},{"$f":"F224+0.08","v":0.54999999999999993},{"$f":"IF(E225=0,F225,IF(F225=0,E225,AVERAGE(E225,F225)))","v":0.47499999999999998},{"$f":"ROUND(IF(C225=\"TON\",IF(D225=\"CWT\",G225/20,IF(D225=\"LBS\",G225/(0.335*2000),IF(D225=\"GAL\",(G225/(0.335*2000))*11.5,G225))),G225),2)","v":0.48}]
[505,"  30% N (LIQ)","TON","CWT",215,270,242.5,{"$f":"ROUND(IF(C226=\"TON\",IF(D226=\"CWT\",G226/20,IF(D226=\"LBS\",G226/(0.335*2000),IF(D226=\"GAL\",(G226/(0.335*2000))*11.5,G226))),G226),2)","v":12.13}]
[506,"  30% N (LIQ) - Side Dressing","LBS","LBS",null,null,0,{"$f":"ROUND(IF(C227=\"TON\",IF(D227=\"CWT\",G227/20,IF(D227=\"LBS\",G227/(0.3*2000),IF(D227=\"GAL\",(G227/(0.3*2000))*11.5,G227))),G227),2)","v":0}]
[507,"  24.5% N (LIQ) - Side Dressing","TON","CWT",null,null,0,{"$f":"ROUND(IF(C228=\"TON\",IF(D228=\"CWT\",G228/20,IF(D228=\"LBS\",G228/(0.245*2000),IF(D228=\"GAL\",(G228/(0.245*2000))*11.5,G228))),G228),2)","v":0}]
[508,"  30% N (LIQ) - Side Dressing (VEG.)","TON","CWT",null,null,0,{"$f":"ROUND(IF(C229=\"TON\",IF(D229=\"CWT\",G229/20,IF(D229=\"LBS\",G229/(0.3*2000),IF(D229=\"GAL\",(G229/(0.3*2000))*11.5,G229))),G229),2)","v":0}]
[509,"  34-0-0-11 Ammonium Sulphate + Urea","TON","CWT",null,null,{"$f":"IF(E230=0,F230,IF(F230=0,E230,AVERAGE(E230,F230)))","v":0},{"$f":"ROUND(IF(C230=\"TON\",IF(D230=\"CWT\",G230/20,IF(D230=\"LBS\",G230/(0.335*2000),IF(D230=\"GAL\",(G230/(0.335*2000))*11.5,G230))),G230),2)","v":0}]
[510,null,null,null,null,null,{"$f":"IF(E231=0,F231,IF(F231=0,E231,AVERAGE(E231,F231)))","v":0},{"$f":"ROUND(IF(C231=\"TON\",IF(D231=\"CWT\",G231/20,IF(D231=\"LBS\",G231/(0.335*2000),IF(D231=\"GAL\",(G231/(0.335*2000))*11.5,G231))),G231),2)","v":0}]
[511,"  15.5% Calcium Nitrate","TON","CWT",417,565,{"$f":"IF(E232=0,F232,IF(F232=0,E232,AVERAGE(E232,F232)))","v":491},{"$f":"ROUND(IF(C232=\"TON\",IF(D232=\"CWT\",G232/20,IF(D232=\"LBS\",G232/(0.155*2000),IF(D232=\"GAL\",(G232/(0.155*2000))*11.5,G232))),G232),2)","v":24.55}]
[512,"  K2O","LBS","LBS",0.42,0.42,0.42,{"$f":"ROUND(IF(C233=\"TON\",IF(D233=\"CWT\",G233/20,IF(D233=\"LBS\",G233/(0.6*2000),IF(D233=\"GAL\",(G233/(0.6*2000))*11.5,G233))),G233),2)","v":0.42}]
[512.5,"  60% Murate of Potash","TON","LBS",378,419,{"$f":"IF(E234=0,F234,IF(F234=0,E234,AVERAGE(E234,F234)))","v":398.5},{"$f":"ROUND(IF(C234=\"TON\",IF(D234=\"CWT\",G234/20,IF(D234=\"LBS\",G234/(0.6*2000),IF(D234=\"GAL\",(G234/(0.6*2000))*11.5,G234))),G234),2)","v":0.33}]
[513,"  46% UREA","TON","LBS",380,425,{"$f":"IF(E235=0,F235,IF(F235=0,E235,AVERAGE(E235,F235)))","v":402.5},{"$f":"ROUND(IF(C235=\"TON\",IF(D235=\"CWT\",G235/20,IF(D235=\"LBS\",G235/(0.46*2000),IF(D235=\"GAL\",(G235/(0.46*2000))*11.5,G235))),G235),2)","v":0.44}]
[514,"  P2O5","LBS","LBS",0.62,0.62,{"$f":"IF(E236=0,F236,IF(F236=0,E236,AVERAGE(E236,F236)))","v":0.62},0.62]
[514.5,"  46% Superphosphate","TON","LBS",475,549,{"$f":"IF(E237=0,F237,IF(F237=0,E237,AVERAGE(E237,F237)))","v":512},{"$f":"ROUND(IF(C237=\"TON\",IF(D237=\"CWT\",G237/20,IF(D237=\"LBS\",G237/(0.46*2000),IF(D237=\"GAL\",(G237/(0.46*2000))*11.5,G237))),G237),2)","v":0.56000000000000005}]
[514.9,"  P2O5 + AVAIL","LBS","LBS",{"$f":"E236+0.07","v":0.69},{"$f":"F236+0.11","v":0.73},{"$f":"IF(E238=0,F238,IF(F238=0,E238,AVERAGE(E238,F238)))","v":0.71},{"$f":"ROUND(IF(C238=\"TON\",IF(D238=\"CWT\",G238/20,IF(D238=\"LBS\",G238/(0.46*2000),IF(D238=\"GAL\",(G238/(0.46*2000))*11.5,G238))),G238),2)","v":0.71}]
[515,"  Borax","LBS","LBS",0.42,0.65,0.53500000000000003,0.54]
[515.1,"  Liquid Boron +","Gal","PT",3.69,null,{"$f":"IF(E240=0,F240,IF(F240=0,E240,AVERAGE(E240,F240)))","v":3.69},{"$f":"ROUND(IF(C240=\"TON\",IF(D240=\"CWT\",G240/20,IF(D240=\"LBS\",G240/(0.46*2000),IF(D240=\"GAL\",(G240/(0.46*2000))*11.5,G240))),G240/8),2)","v":0.46}]
[515.5,"  50% Sulphate of Potash","TON","LBS",590,null,{"$f":"IF(E241=0,F241,IF(F241=0,E241,AVERAGE(E241,F241)))","v":590},0.64]
[515.9,"  90% Sulfur","LBS","LBS",{"$f":"17.64/30","v":0.58799999999999997},null,0.58799999999999997,{"$f":"ROUND(IF(C242=\"TON\",IF(D242=\"CWT\",G242/20,IF(D242=\"LBS\",G242/(1*2000),IF(D242=\"GAL\",(G242/(1*2000))*11.5,G242))),G242),2)","v":0.59}]
[516,"  18-46-0 DAP","TON","CWT",508,550,529,{"$f":"ROUND(IF(C243=\"TON\",IF(D243=\"CWT\",G243/20,IF(D243=\"LBS\",G243/2000,IF(D243=\"GAL\",(G243/2000)*11.5,G243))),G243),2)","v":26.45}]
[516.5,"  11-52-0 MAP","TON","CWT",542,588,{"$f":"IF(E244=0,F244,IF(F244=0,E244,AVERAGE(E244,F244)))","v":565},{"$f":"ROUND(IF(C244=\"TON\",IF(D244=\"CWT\",G244/20,IF(D244=\"LBS\",G244/2000,IF(D244=\"GAL\",(G244/2000)*11.5,G244))),G244),2)","v":28.25}]
[517,"  Lime Bulk at Source","TON","TON",15,27,21,21]
[517.5,"  Lime Bulk Hauling","Ton/Mile","Ton/Mile",0.25,null,{"$f":"IF(E246=0,F246,IF(F246=0,E246,AVERAGE(E246,F246)))","v":0.25},{"$f":"ROUND(IF(C246=\"TON\",IF(D246=\"CWT\",G246/20,IF(D246=\"LBS\",G246/2000,IF(D246=\"GAL\",(G246/2000)*11.5,G246))),G246),2)","v":0.25}]
[518,"  Lime Spread","TON","TON",47,54,50.5,50.5]
[519,"  Cost to Spread 1 Ton on an Acre","ACRE","ACRE",7,null,7,7]
[520,"  6-6-18 (Bagged)","TON","CWT",{"$f":"14.95*40","v":598},{"$f":"16.6*40","v":664},631,31.55]
[521,"  6-12-18 (Bagged)","TON","CWT",665,742,{"$f":"IF(E250=0,F250,IF(F250=0,E250,AVERAGE(E250,F250)))","v":703.5},{"$f":"ROUND(IF(C250=\"TON\",IF(D250=\"CWT\",G250/20,IF(D250=\"LBS\",G250/2000,IF(D250=\"GAL\",(G250/2000)*11.5,G250))),G250),2)","v":35.18}]
[522,"  13-0-14 (Bagged)","TON","CWT",720,690,{"$f":"IF(E251=0,F251,IF(F251=0,E251,AVERAGE(E251,F251)))","v":705},{"$f":"ROUND(IF(C251=\"TON\",IF(D251=\"CWT\",G251/20,IF(D251=\"LBS\",G251/2000,IF(D251=\"GAL\",(G251/2000)*11.5,G251))),G251),2)","v":35.25}]
[523,"  SOLUBOR","LBS","LBS",1.5,null,1.5,1.5]
[524,"  5-10-10 (Bagged)","TON","CWT",{"$f":"9.5*40","v":380},null,380,19]
[525,"  5-10-10 (Veg)","TON","CWT",null,null,0,0]
[526,"  10-10-10 (Bagged)","TON","CWT",250,475,362.5,18.13]
[526.5,"  10-10-10 (Veg)","TON","CWT",276,550,413,20.65]
[526.9,"  17-17-17","TON","CWT",403,570,{"$f":"IF(E257=0,F257,IF(F257=0,E257,AVERAGE(E257,F257)))","v":486.5},{"$f":"ROUND(IF(C257=\"TON\",IF(D257=\"CWT\",G257/20,IF(D257=\"LBS\",G257/2000,IF(D257=\"GAL\",(G257/2000)*11.5,G257))),G257),2)","v":24.33}]
[527,"  27-0-0","TON","CWT",655,null,{"$f":"IF(E258=0,F258,IF(F258=0,E258,AVERAGE(E258,F258)))","v":655},{"$f":"ROUND(IF(C258=\"TON\",IF(D258=\"CWT\",G258/20,IF(D258=\"LBS\",G258/2000,IF(D258=\"GAL\",(G258/2000)*11.5,G258))),G258),2)","v":32.75}]
[528,"  12-24-18 ","TON","LBS",null,null,0,0]
[529,"  10-52-8 ","LBS","LBS",null,null,0,0]
[530,"  10-20-20 ","TON","CWT",422,null,422,21.1]
[531,"  13-13-13","TON","CWT",480,660,570,28.5]
[532,"  4-12-12 ","TON","CWT",null,null,0,0]
[533,"  6-3-18","TON","CWT",602.33000000000004,636.37,619.35,30.97]
[534,"  10-8-20 ","TON","CWT",null,null,0,0]
[535,"  7-0-7 (LIQ.) - Side Dressing","TON","CWT",null,null,0,0]
[536,"  10-34-0","TON","GAL",614,638,626,3.6]
[537,"  8-8-24 (Bagged)","TON","CWT",795,860,827.5,41.38]
[538,"  8-16-24 (Bagged)","TON","CWT",840,868,854,{"$f":"ROUND(IF(C269=\"TON\",IF(D269=\"CWT\",G269/20,IF(D269=\"LBS\",G269/2000,IF(D269=\"GAL\",(G269/2000)*11.5,G269))),G269),2)","v":42.7}]
[539,"  10-34-0","TON","CWT",445,580,512.5,25.63]
[540,"  15-0-14 (Bagged)","TON","CWT",null,null,0,0]
[541,"  14-0-14 (Bagged)","TON","CWT",null,null,0,0]
[543,"  Aluminum Sulfate 57.6%AL 14%S","LBS","LBS",{"$f":"43.7/50","v":0.87400000000000011},null,{"$f":"IF(E273=0,F273,IF(F273=0,E273,AVERAGE(E273,F273)))","v":0.87400000000000011},{"$f":"ROUND(IF(C273=\"TON\",IF(D273=\"CWT\",G273/20,IF(D273=\"LBS\",G273/2000,IF(D273=\"GAL\",(G273/2000)*11.5,G273))),G273),2)","v":0.87}]
[544,"  Calcium Sulfate 19.9%CA 15.9%S","LBS","LBS",{"$f":"7.25/50","v":0.14499999999999999},{"$f":"8.5/50","v":0.17},0.1575,0.16]
[545,"  Iron Sulfate 20%FE 11.5%S","LBS","LBS",{"$f":"41/50","v":0.82},{"$f":"34.7/50","v":0.69400000000000006},{"$f":"IF(E275=0,F275,IF(F275=0,E275,AVERAGE(E275,F275)))","v":0.75700000000000001},{"$f":"ROUND(IF(C275=\"TON\",IF(D275=\"CWT\",G275/20,IF(D275=\"LBS\",G275/2000,IF(D275=\"GAL\",(G275/2000)*11.5,G275))),G275),2)","v":0.76}]
[545,"  Magnesium Sulfate (Epsom Salt)","LBS","LBS",{"$f":"41/50","v":0.82},null,{"$f":"IF(E276=0,F276,IF(F276=0,E276,AVERAGE(E276,F276)))","v":0.82},{"$f":"ROUND(IF(C276=\"TON\",IF(D276=\"CWT\",G276/20,IF(D276=\"LBS\",G276/2000,IF(D276=\"GAL\",(G276/2000)*11.5,G276))),G276),2)","v":0.82}]
[551,"  CoRoN 25-0-0 .5%B","Gal","GAL",12.7,11.79,12.244999999999999,12.25]
[551.5,"  CoRoN 12-0-0 5%B","Gal","GAL",18.899999999999999,16.3,{"$f":"IF(E278=0,F278,IF(F278=0,E278,AVERAGE(E278,F278)))","v":17.600000000000001},17.600000000000001]
[552,"  Tracite 12-48-20 W/Micronutrients","LBS","LBS",1.68,1.79,{"$f":"IF(E279=0,F279,IF(F279=0,E279,AVERAGE(E279,F279)))","v":1.7349999999999999},1.74]
[552.5,"  Tracite 20-20-20 W/Micronutrients","LBS","LBS",1.58,1.64,{"$f":"IF(E280=0,F280,IF(F280=0,E280,AVERAGE(E280,F280)))","v":1.6099999999999999},1.61]
[575,"  SOLUBOR","LBS","LBS",1.55,1.6,{"$f":"IF(E281=0,F281,IF(F281=0,E281,AVERAGE(E281,F281)))","v":1.5750000000000002},1.58]
[600,"  Soil Amendments"]
[601,"  Plaster 420","Ton","Ton",45,50,{"$f":"IF(E283=0,F283,IF(F283=0,E283,AVERAGE(E283,F283)))","v":47.5},{"$f":"ROUND(IF(C283=\"TON\",IF(D283=\"CWT\",G283/20,IF(D283=\"LBS\",G283/2000,IF(D283=\"GAL\",(G283/2000)*11.5,G283))),G283),2)","v":47.5}]
[602,"  Peanut Maker","Ton","Ton",45,50,47.5,47.5]
[603,"  Hydra-Hume 6L","Gal","GAL",11.05,null,11.05,11.05]
[700,"  Organic 4-2-2","Ton","Ton",400,null,400,400]
[725,"  Rock Phosphate 0-3-0","Ton","LBS",{"$f":"10.25*40","v":410},{"$f":"13*40","v":520},{"$f":"IF(E287=0,F287,IF(F287=0,E287,AVERAGE(E287,F287)))","v":465},0.23]
[750,"  Potassium Sulphate 0-0-51-18S","TON","LBS",{"$f":"38.5*40","v":1540},null,{"$f":"IF(E288=0,F288,IF(F288=0,E288,AVERAGE(E288,F288)))","v":1540},0.77]
[755," Poultry Litter","TON","TON",35,35,35,35]
[775,"MicroStart 3-2-3","Ton","Ton",465,495,480,480]
[800,"Pallets 40x48","eash","each",2,10,6,6]
[801,"Bins Printed","each","each",9.5,11,10.25,10.25]
[802,"Bins Generic","each","each",5,7,6,6]

{"sheet":"Rates","index":4,"n_rows":57,"n_cols":8,"rows_kept":57,"cut":false,"hidden":false,"merged":[[19,6,19,7]]}
["Market Prices (Income) and Rates & Costs (Expenses)"]
["NAME",null,null,null,"VALUE"]
[]
["Interest Rate (%)",null,null,null,7.25]
["Insurance Rate ($/1000)",null,null,null,8.5]
["Equipment Tax Rates ($/1000)",null,0,2.44,0,"Varies by County"]
["Diesel Price ($/gallon)",null,2.11,2.4,2.4,0.45200000000000001]
["Gas price ($/gallon)","No Ethanol",null,null,2.69]
["LP Price ($/gallon)",null,1.27,1.45,1.4]
["LUBRICATION COST (%)",null,null,null,15]
["LABOR RATE ($/HOUR)",null,null,null,16,11.46,14.19]
["FUEL CONSUMPTION MULTIPLIER (DIESEL)",null,null,null,4.8000000000000001E-2,3.5000000000000003E-2,5.3999999999999999E-2]
["FUEL CONSUMPTION MULTIPLIER (GASOLINE)",null,null,null,0.06]
["FUEL CONSUMPTION MULTIPLIER (LPG)",null,null,null,0.08]
["MACHINERY LABOR MULTIPLIER",null,null,null,1.1000000000000001]
["UNALLOCATED LABOR HOURS MULTIPLIER",null,null,null,1.25]
["INTEREST ON OPERATIONAL CAPITAL (%)",null,null,null,5.5]
["GENERAL OVERHEAD RATE (%)",null,null,null,8]
["HAULING ($/BU.)",null,null,null,0.25]
[null,null,null,null,null,null,"Crop Insurance"]
["Market Prices",null,"GMO","Non-GMO","Organic","Other","Sub Cost","Price"]
["Barley (Feed)","$/BU.",3.3,null,null,null,3.83,4.4000000000000004]
["Corn","$/BU.",3.4,null,null,null,17.48,4.5999999999999996]
["Corn Silage","$/Ton",45]
["Grain Sorghum","$/BU.",3.12,null,null,null,9.5299999999999994,5.53]
["Soybeans","$/BU.",9,null,null,null,13.11,12.91]
["Wheat","$/BU.",4.5,null,null,null,6.95,6.72]
["Small Grain Silage","$/Ton",45]
["Sorghum Silage","$/Ton",45]
["Straw","$/Bale",5]
["Alfalfa Hay","$/Ton",180,null,{"$f":"C31*1.5","v":270}]
["Alfalfa Haylage","$/Ton",100,null,150]
["Grass/Legume Hay","$/Ton",125,null,187.5]
["Mixed Grass Hay","$/Ton",100,null,150]
["Fescue Hay","$/Ton",80,null,120]
["Other Hay","$/Ton",60,null,90]
["Pasture, Forage","$/Acre",24.5,null,null,null,6.41,55.05]
["Cotton","$/Lb",0.72,null,null,null,15.84,0.83]
["Peanuts-Virginia","$/Ton",480,null,null,null,16.829999999999998,532]
["Peanuts-Runner","$/Ton",420,null,null,null,16.829999999999998,{"$f":"0.266*2000","v":532}]
["Flue-cured Tobacco","$/Lb",1.8,null,null,2,186.71,2.15]
["Dark-fired Tobacco","$/Lb",2.2000000000000002,null,null,2.48,252.17,2.1]
["Burley Tobacco","$/Lb",1.65,null,null,1.8,499.38,1.8]
["Oats","$/BU.",null,null,null,null,7.47]
["Canola","$/cwt",17.399999999999999,null,null,null,7.55,22.9]
[]
["Distance between Rows","Width Ft",4,5,6,8]
["VIF Mulch","Linear Ft",{"$f":"138/2400","v":5.7500000000000002E-2}]
["TIF Mulch","Linear Ft",{"$f":"((108/4000)+(98/2400))/2","v":3.3916666666666664E-2},{"$f":"((81/2400)+(102/2400))/2","v":3.8125000000000006E-2},{"$f":"((81/2000)+(98/2400))/2","v":4.066666666666667E-2}]
["Floating Row Cover","Sq. Yard",null,{"$f":"(836/(39*800/9))/2","v":0.12057692307692308}]
["Drip Irrigation","Linear Ft",{"$f":"151/6000","v":2.5166666666666667E-2},{"$f":"198/6000","v":3.3000000000000002E-2},{"$f":"AVERAGE(C51:D51)","v":2.9083333333333336E-2}]
["Drip Irrigation VC","Acre/Inch",15.58,15.56,15.55,15.53]
["Drip Irrigation FC","Acre",164.55,160.19999999999999,157.29,153.66]
["K-Line Starter Kit","5 Pods",890]
[]
["Net Wrap 64x6560",243.95]
["Net Wrap 48x6200",178.95]